BDBM50304416 CHEMBL595039::cis-4-(3,4-Dimethoxyphenyl)-2-{4-[(dimethylamino)-methyl]benzyl}-4a,5,8,8a-tetrahydrophthalazin-1(2H)-one
SMILES: COc1ccc(cc1OC)C1=NN(Cc2ccc(CN(C)C)cc2)C(=O)[C@@H]2CC=CC[C@H]12
InChI Key: InChIKey=XRMZXWCUVMFYJF-FCHUYYIVSA-N
Data: 1 IC50
Activity Spreadsheet -- Enzyme Inhibition Constant Data from BindingDB
Found 1 hit for monomerid = 50304416
Trg + Lig
Ki
nM
ΔG°
kcal/mole
IC50
nM
Kd
nM
EC50/IC50
nM
koff
s-1
kon
M-1s-1
pHTemp
°C
cAMP-specific 3',5'-cyclic phosphodiesterase 4D
(Homo sapiens (Human))
BDBM50304416
(CHEMBL595039 | cis-4-(3,4-Dimethoxyphenyl)-2-{4-[(...)
Show SMILES COc1ccc(cc1OC)C1=NN(Cc2ccc(CN(C)C)cc2)C(=O)[C@@H]2CC=CC[C@H]12 |r,c:30,t:11|
Show InChI InChI=1S/C26H31N3O3/c1-28(2)16-18-9-11-19(12-10-18)17-29-26(30)22-8-6-5-7-21(22)25(27-29)20-13-14-23(31-3)24(15-20)32-4/h5-6,9-15,21-22H,7-8,16-17H2,1-4H3/t21-,22+/m0/s1
n/an/a 9.70n/an/an/an/an/an/a
Kyoto 601-8550
Curated by ChEMBL
Assay Description
Inhibition of human recombinant PDE4D catalytic domain cloned from human HL60 cells assessed as inhibition of cAMP hydrolysis
Bioorg Med Chem 17: 6959-70 (2009)
Article DOI: 10.1016/j.bmc.2009.08.014
BindingDB Entry DOI: 10.7270/Q2WH2Q26