BDBM50304917 CHEMBL596401::N-(3,4-dimethyl-5-(morpholinosulfonyl)phenyl)-2,2-dimethylbutanamide
SMILES: CCC(C)(C)C(=O)Nc1cc(C)c(C)c(c1)S(=O)(=O)N1CCOCC1
InChI Key: InChIKey=PKRUKJFKTCSMRE-UHFFFAOYSA-N
Data: 2 KI  1 EC50
Activity Spreadsheet -- Enzyme Inhibition Constant Data from BindingDB
Found 3 hits for monomerid = 50304917
Trg + Lig
Ki
nM
ΔG°
kcal/mole
IC50
nM
Kd
nM
EC50/IC50
nM
koff
s-1
kon
M-1s-1
pHTemp
°C
Cannabinoid receptor 2
(Homo sapiens (Human))
BDBM50304917
(CHEMBL596401 | N-(3,4-dimethyl-5-(morpholinosulfon...)
Show SMILES CCC(C)(C)C(=O)Nc1cc(C)c(C)c(c1)S(=O)(=O)N1CCOCC1
Show InChI InChI=1S/C18H28N2O4S/c1-6-18(4,5)17(21)19-15-11-13(2)14(3)16(12-15)25(22,23)20-7-9-24-10-8-20/h11-12H,6-10H2,1-5H3,(H,19,21)
Reactome pathway
17n/an/an/an/an/an/an/an/a
Adolor Corporation
Curated by ChEMBL
Assay Description
Displacement of [3H]CP55940 from human CB2 receptor
Bioorg Med Chem Lett 20: 387-91 (2010)
Article DOI: 10.1016/j.bmcl.2009.10.062
BindingDB Entry DOI: 10.7270/Q27P8ZGK
Cannabinoid receptor 1
(Homo sapiens (Human))
BDBM50304917
(CHEMBL596401 | N-(3,4-dimethyl-5-(morpholinosulfon...)
Show SMILES CCC(C)(C)C(=O)Nc1cc(C)c(C)c(c1)S(=O)(=O)N1CCOCC1
Show InChI InChI=1S/C18H28N2O4S/c1-6-18(4,5)17(21)19-15-11-13(2)14(3)16(12-15)25(22,23)20-7-9-24-10-8-20/h11-12H,6-10H2,1-5H3,(H,19,21)
NCI pathway
Reactome pathway
2.50E+3n/an/an/an/an/an/an/an/a
Adolor Corporation
Curated by ChEMBL
Assay Description
Displacement of [3H]CP55940 from human CB1 receptor
Bioorg Med Chem Lett 20: 387-91 (2010)
Article DOI: 10.1016/j.bmcl.2009.10.062
BindingDB Entry DOI: 10.7270/Q27P8ZGK
Cannabinoid receptor 2
(Rattus norvegicus (Rat))
BDBM50304917
(CHEMBL596401 | N-(3,4-dimethyl-5-(morpholinosulfon...)
Show SMILES CCC(C)(C)C(=O)Nc1cc(C)c(C)c(c1)S(=O)(=O)N1CCOCC1
Show InChI InChI=1S/C18H28N2O4S/c1-6-18(4,5)17(21)19-15-11-13(2)14(3)16(12-15)25(22,23)20-7-9-24-10-8-20/h11-12H,6-10H2,1-5H3,(H,19,21)
n/an/an/an/a 38n/an/an/an/a
Adolor Corporation
Curated by ChEMBL
Assay Description
Agonist activity at rat brain CB2 receptor by GTPgammaS binding assay
Bioorg Med Chem Lett 20: 387-91 (2010)
Article DOI: 10.1016/j.bmcl.2009.10.062
BindingDB Entry DOI: 10.7270/Q27P8ZGK