BDBM50304957 (S)-2-chloro-4-((2-methylbenzyl)(1-propionylpyrrolidin-3-yl)amino)benzonitrile::CHEMBL592532
SMILES: CCC(=O)N1CC[C@@H](C1)N(Cc1ccccc1C)c1ccc(C#N)c(Cl)c1
InChI Key: InChIKey=RSLXSKBLDYLVTA-FQEVSTJZSA-N
Data: 3 IC50  1 EC50
Activity Spreadsheet -- Enzyme Inhibition Constant Data from BindingDB
Found 4 hits for monomerid = 50304957
Trg + Lig
Ki
nM
ΔG°
kcal/mole
IC50
nM
Kd
nM
EC50/IC50
nM
koff
s-1
kon
M-1s-1
pHTemp
°C
Progesterone receptor
(Homo sapiens (Human))
BDBM50304957
((S)-2-chloro-4-((2-methylbenzyl)(1-propionylpyrrol...)
Show SMILES CCC(=O)N1CC[C@@H](C1)N(Cc1ccccc1C)c1ccc(C#N)c(Cl)c1 |r|
Show InChI InChI=1S/C22H24ClN3O/c1-3-22(27)25-11-10-20(15-25)26(14-18-7-5-4-6-16(18)2)19-9-8-17(13-24)21(23)12-19/h4-9,12,20H,3,10-11,14-15H2,1-2H3/t20-/m0/s1
n/an/a 16n/an/an/an/an/an/a
GlaxoSmithKline Pharmaceuticals
Curated by ChEMBL
Assay Description
Inhibition of PR
Bioorg Med Chem Lett 20: 371-4 (2010)
Article DOI: 10.1016/j.bmcl.2009.10.092
BindingDB Entry DOI: 10.7270/Q2057G17
Cytochrome P450 2C9
(Homo sapiens (Human))
BDBM50304957
((S)-2-chloro-4-((2-methylbenzyl)(1-propionylpyrrol...)
Show SMILES CCC(=O)N1CC[C@@H](C1)N(Cc1ccccc1C)c1ccc(C#N)c(Cl)c1 |r|
Show InChI InChI=1S/C22H24ClN3O/c1-3-22(27)25-11-10-20(15-25)26(14-18-7-5-4-6-16(18)2)19-9-8-17(13-24)21(23)12-19/h4-9,12,20H,3,10-11,14-15H2,1-2H3/t20-/m0/s1
Reactome pathway
n/an/a 4.00E+3n/an/an/an/an/an/a
GlaxoSmithKline Pharmaceuticals
Curated by ChEMBL
Assay Description
Inhibition of CYP2C9
Bioorg Med Chem Lett 20: 371-4 (2010)
Article DOI: 10.1016/j.bmcl.2009.10.092
BindingDB Entry DOI: 10.7270/Q2057G17
Cytochrome P450 2D6
(Homo sapiens (Human))
BDBM50304957
((S)-2-chloro-4-((2-methylbenzyl)(1-propionylpyrrol...)
Show SMILES CCC(=O)N1CC[C@@H](C1)N(Cc1ccccc1C)c1ccc(C#N)c(Cl)c1 |r|
Show InChI InChI=1S/C22H24ClN3O/c1-3-22(27)25-11-10-20(15-25)26(14-18-7-5-4-6-16(18)2)19-9-8-17(13-24)21(23)12-19/h4-9,12,20H,3,10-11,14-15H2,1-2H3/t20-/m0/s1
n/an/a 2.00E+4n/an/an/an/an/an/a
GlaxoSmithKline Pharmaceuticals
Curated by ChEMBL
Assay Description
Inhibition of CYP2D6
Bioorg Med Chem Lett 20: 371-4 (2010)
Article DOI: 10.1016/j.bmcl.2009.10.092
BindingDB Entry DOI: 10.7270/Q2057G17
Progesterone receptor
(Homo sapiens (Human))
BDBM50304957
((S)-2-chloro-4-((2-methylbenzyl)(1-propionylpyrrol...)
Show SMILES CCC(=O)N1CC[C@@H](C1)N(Cc1ccccc1C)c1ccc(C#N)c(Cl)c1 |r|
Show InChI InChI=1S/C22H24ClN3O/c1-3-22(27)25-11-10-20(15-25)26(14-18-7-5-4-6-16(18)2)19-9-8-17(13-24)21(23)12-19/h4-9,12,20H,3,10-11,14-15H2,1-2H3/t20-/m0/s1
n/an/an/an/a 2.10n/an/an/an/a
GlaxoSmithKline Pharmaceuticals
Curated by ChEMBL
Assay Description
Agonist activity at PR in human T47D cells
Bioorg Med Chem Lett 20: 371-4 (2010)
Article DOI: 10.1016/j.bmcl.2009.10.092
BindingDB Entry DOI: 10.7270/Q2057G17