BDBM50304972 (S)-2-chloro-4-((2-chlorobenzyl)(1-(methylsulfonyl)pyrrolidin-3-yl)amino)benzonitrile::CHEMBL602745
SMILES: CS(=O)(=O)N1CC[C@@H](C1)N(Cc1ccccc1Cl)c1ccc(C#N)c(Cl)c1
InChI Key: InChIKey=GOHKIDSTSAUHCB-KRWDZBQOSA-N
Data: 3 IC50  1 EC50
Activity Spreadsheet -- Enzyme Inhibition Constant Data from BindingDB
Found 4 hits for monomerid = 50304972
Trg + Lig
Ki
nM
ΔG°
kcal/mole
IC50
nM
Kd
nM
EC50/IC50
nM
koff
s-1
kon
M-1s-1
pHTemp
°C
Progesterone receptor
(Homo sapiens (Human))
BDBM50304972
((S)-2-chloro-4-((2-chlorobenzyl)(1-(methylsulfonyl...)
Show SMILES CS(=O)(=O)N1CC[C@@H](C1)N(Cc1ccccc1Cl)c1ccc(C#N)c(Cl)c1 |r|
Show InChI InChI=1S/C19H19Cl2N3O2S/c1-27(25,26)23-9-8-17(13-23)24(12-15-4-2-3-5-18(15)20)16-7-6-14(11-22)19(21)10-16/h2-7,10,17H,8-9,12-13H2,1H3/t17-/m0/s1
n/an/an/an/a 1n/an/an/an/a
GlaxoSmithKline Pharmaceuticals
Curated by ChEMBL
Assay Description
Agonist activity at PR in human T47D cells
Bioorg Med Chem Lett 20: 371-4 (2010)
Article DOI: 10.1016/j.bmcl.2009.10.092
BindingDB Entry DOI: 10.7270/Q2057G17
Cytochrome P450 2C9
(Homo sapiens (Human))
BDBM50304972
((S)-2-chloro-4-((2-chlorobenzyl)(1-(methylsulfonyl...)
Show SMILES CS(=O)(=O)N1CC[C@@H](C1)N(Cc1ccccc1Cl)c1ccc(C#N)c(Cl)c1 |r|
Show InChI InChI=1S/C19H19Cl2N3O2S/c1-27(25,26)23-9-8-17(13-23)24(12-15-4-2-3-5-18(15)20)16-7-6-14(11-22)19(21)10-16/h2-7,10,17H,8-9,12-13H2,1H3/t17-/m0/s1
Reactome pathway
n/an/a 870n/an/an/an/an/an/a
GlaxoSmithKline Pharmaceuticals
Curated by ChEMBL
Assay Description
Inhibition of CYP2C9
Bioorg Med Chem Lett 20: 371-4 (2010)
Article DOI: 10.1016/j.bmcl.2009.10.092
BindingDB Entry DOI: 10.7270/Q2057G17
Cytochrome P450 2D6
(Homo sapiens (Human))
BDBM50304972
((S)-2-chloro-4-((2-chlorobenzyl)(1-(methylsulfonyl...)
Show SMILES CS(=O)(=O)N1CC[C@@H](C1)N(Cc1ccccc1Cl)c1ccc(C#N)c(Cl)c1 |r|
Show InChI InChI=1S/C19H19Cl2N3O2S/c1-27(25,26)23-9-8-17(13-23)24(12-15-4-2-3-5-18(15)20)16-7-6-14(11-22)19(21)10-16/h2-7,10,17H,8-9,12-13H2,1H3/t17-/m0/s1
n/an/a 3.10E+4n/an/an/an/an/an/a
GlaxoSmithKline Pharmaceuticals
Curated by ChEMBL
Assay Description
Inhibition of CYP2D6
Bioorg Med Chem Lett 20: 371-4 (2010)
Article DOI: 10.1016/j.bmcl.2009.10.092
BindingDB Entry DOI: 10.7270/Q2057G17
Progesterone receptor
(Homo sapiens (Human))
BDBM50304972
((S)-2-chloro-4-((2-chlorobenzyl)(1-(methylsulfonyl...)
Show SMILES CS(=O)(=O)N1CC[C@@H](C1)N(Cc1ccccc1Cl)c1ccc(C#N)c(Cl)c1 |r|
Show InChI InChI=1S/C19H19Cl2N3O2S/c1-27(25,26)23-9-8-17(13-23)24(12-15-4-2-3-5-18(15)20)16-7-6-14(11-22)19(21)10-16/h2-7,10,17H,8-9,12-13H2,1H3/t17-/m0/s1
n/an/a 6n/an/an/an/an/an/a
GlaxoSmithKline Pharmaceuticals
Curated by ChEMBL
Assay Description
Inhibition of PR
Bioorg Med Chem Lett 20: 371-4 (2010)
Article DOI: 10.1016/j.bmcl.2009.10.092
BindingDB Entry DOI: 10.7270/Q2057G17