BDBM50304980 (S)-methyl 3-((3-chloro-4-cyanophenyl)(5-fluoro-2-methylbenzyl)amino)pyrrolidine-1-carboxylate::CHEMBL591327
SMILES: COC(=O)N1CC[C@@H](C1)N(Cc1cc(F)ccc1C)c1ccc(C#N)c(Cl)c1
InChI Key: InChIKey=UOPVVQWLFUUMSP-IBGZPJMESA-N
Data: 3 IC50  1 EC50
Activity Spreadsheet -- Enzyme Inhibition Constant Data from BindingDB
Found 4 hits for monomerid = 50304980
Trg + Lig
Ki
nM
ΔG°
kcal/mole
IC50
nM
Kd
nM
EC50/IC50
nM
koff
s-1
kon
M-1s-1
pHTemp
°C
Progesterone receptor
(Homo sapiens (Human))
BDBM50304980
((S)-methyl 3-((3-chloro-4-cyanophenyl)(5-fluoro-2-...)
Show SMILES COC(=O)N1CC[C@@H](C1)N(Cc1cc(F)ccc1C)c1ccc(C#N)c(Cl)c1 |r|
Show InChI InChI=1S/C21H21ClFN3O2/c1-14-3-5-17(23)9-16(14)12-26(18-6-4-15(11-24)20(22)10-18)19-7-8-25(13-19)21(27)28-2/h3-6,9-10,19H,7-8,12-13H2,1-2H3/t19-/m0/s1
n/an/an/an/a 41n/an/an/an/a
GlaxoSmithKline Pharmaceuticals
Curated by ChEMBL
Assay Description
Agonist activity at PR in human T47D cells
Bioorg Med Chem Lett 20: 371-4 (2010)
Article DOI: 10.1016/j.bmcl.2009.10.092
BindingDB Entry DOI: 10.7270/Q2057G17
Cytochrome P450 2C9
(Homo sapiens (Human))
BDBM50304980
((S)-methyl 3-((3-chloro-4-cyanophenyl)(5-fluoro-2-...)
Show SMILES COC(=O)N1CC[C@@H](C1)N(Cc1cc(F)ccc1C)c1ccc(C#N)c(Cl)c1 |r|
Show InChI InChI=1S/C21H21ClFN3O2/c1-14-3-5-17(23)9-16(14)12-26(18-6-4-15(11-24)20(22)10-18)19-7-8-25(13-19)21(27)28-2/h3-6,9-10,19H,7-8,12-13H2,1-2H3/t19-/m0/s1
Reactome pathway
n/an/a 1.10E+3n/an/an/an/an/an/a
GlaxoSmithKline Pharmaceuticals
Curated by ChEMBL
Assay Description
Inhibition of CYP2C9
Bioorg Med Chem Lett 20: 371-4 (2010)
Article DOI: 10.1016/j.bmcl.2009.10.092
BindingDB Entry DOI: 10.7270/Q2057G17
Cytochrome P450 2D6
(Homo sapiens (Human))
BDBM50304980
((S)-methyl 3-((3-chloro-4-cyanophenyl)(5-fluoro-2-...)
Show SMILES COC(=O)N1CC[C@@H](C1)N(Cc1cc(F)ccc1C)c1ccc(C#N)c(Cl)c1 |r|
Show InChI InChI=1S/C21H21ClFN3O2/c1-14-3-5-17(23)9-16(14)12-26(18-6-4-15(11-24)20(22)10-18)19-7-8-25(13-19)21(27)28-2/h3-6,9-10,19H,7-8,12-13H2,1-2H3/t19-/m0/s1
n/an/a 2.80E+4n/an/an/an/an/an/a
GlaxoSmithKline Pharmaceuticals
Curated by ChEMBL
Assay Description
Inhibition of CYP2D6
Bioorg Med Chem Lett 20: 371-4 (2010)
Article DOI: 10.1016/j.bmcl.2009.10.092
BindingDB Entry DOI: 10.7270/Q2057G17
Progesterone receptor
(Homo sapiens (Human))
BDBM50304980
((S)-methyl 3-((3-chloro-4-cyanophenyl)(5-fluoro-2-...)
Show SMILES COC(=O)N1CC[C@@H](C1)N(Cc1cc(F)ccc1C)c1ccc(C#N)c(Cl)c1 |r|
Show InChI InChI=1S/C21H21ClFN3O2/c1-14-3-5-17(23)9-16(14)12-26(18-6-4-15(11-24)20(22)10-18)19-7-8-25(13-19)21(27)28-2/h3-6,9-10,19H,7-8,12-13H2,1-2H3/t19-/m0/s1
n/an/a 20n/an/an/an/an/an/a
GlaxoSmithKline Pharmaceuticals
Curated by ChEMBL
Assay Description
Inhibition of PR
Bioorg Med Chem Lett 20: 371-4 (2010)
Article DOI: 10.1016/j.bmcl.2009.10.092
BindingDB Entry DOI: 10.7270/Q2057G17