BDBM50304999 CHEMBL590834::N4-(3-(naphthalen-2-yl)-1H-indazol-5-yl)pyrimidine-2,4-diamine
SMILES: Nc1nccc(Nc2ccc3[nH]nc(-c4ccc5ccccc5c4)c3c2)n1
InChI Key: InChIKey=IZXPFVIQVFQGBQ-UHFFFAOYSA-N
Data: 1 IC50
Activity Spreadsheet -- Enzyme Inhibition Constant Data from BindingDB
Found 1 hit for monomerid = 50304999
Trg + Lig
Ki
nM
ΔG°
kcal/mole
IC50
nM
Kd
nM
EC50/IC50
nM
koff
s-1
kon
M-1s-1
pHTemp
°C
MAP kinase-activated protein kinase 2
(Homo sapiens (Human))
BDBM50304999
(CHEMBL590834 | N4-(3-(naphthalen-2-yl)-1H-indazol-...)
Show SMILES Nc1nccc(Nc2ccc3[nH]nc(-c4ccc5ccccc5c4)c3c2)n1
Show InChI InChI=1S/C21H16N6/c22-21-23-10-9-19(25-21)24-16-7-8-18-17(12-16)20(27-26-18)15-6-5-13-3-1-2-4-14(13)11-15/h1-12H,(H,26,27)(H3,22,23,24,25)
NCI pathway
Reactome pathway
n/an/a 310n/an/an/an/an/an/a
Abbott Laboratories
Curated by ChEMBL
Assay Description
Inhibition of MK2
Bioorg Med Chem Lett 20: 334-7 (2010)
Article DOI: 10.1016/j.bmcl.2009.10.103
BindingDB Entry DOI: 10.7270/Q2VD6ZJJ