BDBM50305000 CHEMBL600081::N4-(3-(benzo[b]thiophen-2-yl)-1H-indazol-5-yl)pyrimidine-2,4-diamine
SMILES: Nc1nccc(Nc2ccc3[nH]nc(-c4cc5ccccc5s4)c3c2)n1
InChI Key: InChIKey=LKOUCBSSBZXDFY-UHFFFAOYSA-N
Data: 1 IC50
Activity Spreadsheet -- Enzyme Inhibition Constant Data from BindingDB
Found 1 hit for monomerid = 50305000
Trg + Lig
Ki
nM
ΔG°
kcal/mole
IC50
nM
Kd
nM
EC50/IC50
nM
koff
s-1
kon
M-1s-1
pHTemp
°C
MAP kinase-activated protein kinase 2
(Homo sapiens (Human))
BDBM50305000
(CHEMBL600081 | N4-(3-(benzo[b]thiophen-2-yl)-1H-in...)
Show SMILES Nc1nccc(Nc2ccc3[nH]nc(-c4cc5ccccc5s4)c3c2)n1
Show InChI InChI=1S/C19H14N6S/c20-19-21-8-7-17(23-19)22-12-5-6-14-13(10-12)18(25-24-14)16-9-11-3-1-2-4-15(11)26-16/h1-10H,(H,24,25)(H3,20,21,22,23)
NCI pathway
Reactome pathway
n/an/a 160n/an/an/an/an/an/a
Abbott Laboratories
Curated by ChEMBL
Assay Description
Inhibition of MK2
Bioorg Med Chem Lett 20: 334-7 (2010)
Article DOI: 10.1016/j.bmcl.2009.10.103
BindingDB Entry DOI: 10.7270/Q2VD6ZJJ