BDBM50305009 7-(7-(benzo[b]thiophen-2-yl)-1H-indazol-5-yl)-5-(2-(piperidin-4-yl)ethyl)-5H-pyrrolo[3,2-d]pyrimidin-2-amine::CHEMBL592031
SMILES: Nc1ncc2n(CCC3CCNCC3)cc(-c3cc(-c4cc5ccccc5s4)c4[nH]ncc4c3)c2n1
InChI Key: InChIKey=USFSEVLTPLUQBS-UHFFFAOYSA-N
Data: 1 IC50
Activity Spreadsheet -- Enzyme Inhibition Constant Data from BindingDB
Found 1 hit for monomerid = 50305009
Trg + Lig
Ki
nM
ΔG°
kcal/mole
IC50
nM
Kd
nM
EC50/IC50
nM
koff
s-1
kon
M-1s-1
pHTemp
°C
MAP kinase-activated protein kinase 2
(Homo sapiens (Human))
BDBM50305009
(7-(7-(benzo[b]thiophen-2-yl)-1H-indazol-5-yl)-5-(2...)
Show SMILES Nc1ncc2n(CCC3CCNCC3)cc(-c3cc(-c4cc5ccccc5s4)c4[nH]ncc4c3)c2n1
Show InChI InChI=1S/C28H27N7S/c29-28-31-15-23-27(33-28)22(16-35(23)10-7-17-5-8-30-9-6-17)19-11-20-14-32-34-26(20)21(12-19)25-13-18-3-1-2-4-24(18)36-25/h1-4,11-17,30H,5-10H2,(H,32,34)(H2,29,31,33)
NCI pathway
Reactome pathway
n/an/a 960n/an/an/an/an/an/a
Abbott Laboratories
Curated by ChEMBL
Assay Description
Inhibition of MK2
Bioorg Med Chem Lett 20: 334-7 (2010)
Article DOI: 10.1016/j.bmcl.2009.10.103
BindingDB Entry DOI: 10.7270/Q2VD6ZJJ