null
SMILES: CC1CCCN(C1)C(=O)c1cnc(Nc2ccc(Cl)cc2)c(Cl)c1
InChI Key: InChIKey=AKRBCPCYMFKJLQ-UHFFFAOYSA-N
Activity Spreadsheet -- Enzyme Inhibition Constant Data from BindingDB
Found 1 hit for monomerid = 50305038
Trg + Lig
Ki
nM
ΔG°
kcal/mole
IC50
nM
Kd
nM
EC50/IC50
nM
koff
s-1
kon
M-1s-1
pHTemp
°C
Metabotropic glutamate receptor 5
(Homo sapiens (Human))
BDBM50305038
((5-chloro-6-(4-chlorophenylamino)pyridin-3-yl)(3-m...)
Show SMILES CC1CCCN(C1)C(=O)c1cnc(Nc2ccc(Cl)cc2)c(Cl)c1
Show InChI InChI=1S/C18H19Cl2N3O/c1-12-3-2-8-23(11-12)18(24)13-9-16(20)17(21-10-13)22-15-6-4-14(19)5-7-15/h4-7,9-10,12H,2-3,8,11H2,1H3,(H,21,22)
n/an/a 95n/an/an/an/an/an/a
Novartis Institutes for Biomedical Research
Curated by ChEMBL
Assay Description
Antagonist activity at human mGluR5 assessed as inhibition of glutamate-induced elevation of intracellular calcium concentration
Bioorg Med Chem Lett 20: 184-8 (2010)
Article DOI: 10.1016/j.bmcl.2009.11.001
BindingDB Entry DOI: 10.7270/Q2QN66VN