BDBM50305059 4-(3-(3-chloro-5-(methylsulfonyl)phenoxy)phenyl)-3-methyl-8-(trifluoromethyl)quinoline::CHEMBL594176
SMILES: Cc1cnc2c(cccc2c1-c1cccc(Oc2cc(Cl)cc(c2)S(C)(=O)=O)c1)C(F)(F)F
InChI Key: InChIKey=QRIKQMLMSCHVRS-UHFFFAOYSA-N
Data: 2 IC50
Activity Spreadsheet -- Enzyme Inhibition Constant Data from BindingDB
Found 2 hits for monomerid = 50305059
Trg + Lig
Ki
nM
ΔG°
kcal/mole
IC50
nM
Kd
nM
EC50/IC50
nM
koff
s-1
kon
M-1s-1
pHTemp
°C
Oxysterols receptor LXR-alpha
(Homo sapiens (Human))
BDBM50305059
(4-(3-(3-chloro-5-(methylsulfonyl)phenoxy)phenyl)-3...)
Show SMILES Cc1cnc2c(cccc2c1-c1cccc(Oc2cc(Cl)cc(c2)S(C)(=O)=O)c1)C(F)(F)F
Show InChI InChI=1S/C24H17ClF3NO3S/c1-14-13-29-23-20(7-4-8-21(23)24(26,27)28)22(14)15-5-3-6-17(9-15)32-18-10-16(25)11-19(12-18)33(2,30)31/h3-13H,1-2H3
NCI pathway
Reactome pathway
n/an/a 3n/an/an/an/an/an/a
Wyeth Pharmaceuticals
Curated by ChEMBL
Assay Description
Displacement of [3H]T0901317 from human recombinant LXRalpha-LBD
Bioorg Med Chem Lett 20: 209-12 (2010)
Article DOI: 10.1016/j.bmcl.2009.10.132
BindingDB Entry DOI: 10.7270/Q2KW5G4B
Oxysterols receptor LXR-beta
(Homo sapiens (Human))
BDBM50305059
(4-(3-(3-chloro-5-(methylsulfonyl)phenoxy)phenyl)-3...)
Show SMILES Cc1cnc2c(cccc2c1-c1cccc(Oc2cc(Cl)cc(c2)S(C)(=O)=O)c1)C(F)(F)F
Show InChI InChI=1S/C24H17ClF3NO3S/c1-14-13-29-23-20(7-4-8-21(23)24(26,27)28)22(14)15-5-3-6-17(9-15)32-18-10-16(25)11-19(12-18)33(2,30)31/h3-13H,1-2H3
n/an/a 28n/an/an/an/an/an/a
Wyeth Pharmaceuticals
Curated by ChEMBL
Assay Description
Displacement of [3H]T0901317 from human recombinant LXRbeta-LBD
Bioorg Med Chem Lett 20: 209-12 (2010)
Article DOI: 10.1016/j.bmcl.2009.10.132
BindingDB Entry DOI: 10.7270/Q2KW5G4B