null
SMILES: CN(C)CCOc1ccc2Nc3c(C(N)=O)c(nn3CCc2c1)-c1ccc(O)cc1
InChI Key: InChIKey=CTXNENCIDQVSFG-UHFFFAOYSA-N
Activity Spreadsheet -- Enzyme Inhibition Constant Data from BindingDB
Found 1 hit for monomerid = 50305119
Trg + Lig
Ki
nM
ΔG°
kcal/mole
IC50
nM
Kd
nM
EC50/IC50
nM
koff
s-1
kon
M-1s-1
pHTemp
°C
Tyrosine-protein kinase Lck
(Homo sapiens (Human))
BDBM50305119
(7-(2-(dimethylamino)ethoxy)-2-(4-hydroxyphenyl)-9,...)
Show SMILES CN(C)CCOc1ccc2Nc3c(C(N)=O)c(nn3CCc2c1)-c1ccc(O)cc1
Show InChI InChI=1S/C22H25N5O3/c1-26(2)11-12-30-17-7-8-18-15(13-17)9-10-27-22(24-18)19(21(23)29)20(25-27)14-3-5-16(28)6-4-14/h3-8,13,24,28H,9-12H2,1-2H3,(H2,23,29)
n/an/a 0.440n/an/an/an/an/an/a
Taisho Pharmaceutical Co., Ltd
Curated by ChEMBL
Assay Description
Inhibition of GST-tagged human LCK by scintillation counting
Bioorg Med Chem Lett 20: 112-6 (2010)
Article DOI: 10.1016/j.bmcl.2009.11.013
BindingDB Entry DOI: 10.7270/Q22Z15NV