BDBM50305137 2-(4-phenoxyphenyl)-6-(pyridin-3-ylmethoxy)-9,10-dihydro-4H-benzo[d]pyrazolo[1,5-a][1,3]diazepine-3-carboxamide::CHEMBL606459
SMILES: NC(=O)c1c2Nc3cc(OCc4cccnc4)ccc3CCn2nc1-c1ccc(Oc2ccccc2)cc1
InChI Key: InChIKey=SQVOGFNFSIOLLW-UHFFFAOYSA-N
Data: 1 IC50
Activity Spreadsheet -- Enzyme Inhibition Constant Data from BindingDB
Found 1 hit for monomerid = 50305137
Trg + Lig
Ki
nM
ΔG°
kcal/mole
IC50
nM
Kd
nM
EC50/IC50
nM
koff
s-1
kon
M-1s-1
pHTemp
°C
Tyrosine-protein kinase Lck
(Homo sapiens (Human))
BDBM50305137
(2-(4-phenoxyphenyl)-6-(pyridin-3-ylmethoxy)-9,10-d...)
Show SMILES NC(=O)c1c2Nc3cc(OCc4cccnc4)ccc3CCn2nc1-c1ccc(Oc2ccccc2)cc1
Show InChI InChI=1S/C30H25N5O3/c31-29(36)27-28(22-9-11-24(12-10-22)38-23-6-2-1-3-7-23)34-35-16-14-21-8-13-25(17-26(21)33-30(27)35)37-19-20-5-4-15-32-18-20/h1-13,15,17-18,33H,14,16,19H2,(H2,31,36)
n/an/a 8.20n/an/an/an/an/an/a
Taisho Pharmaceutical Co., Ltd
Curated by ChEMBL
Assay Description
Inhibition of GST-tagged human LCK by scintillation counting
Bioorg Med Chem Lett 20: 112-6 (2010)
Article DOI: 10.1016/j.bmcl.2009.11.013
BindingDB Entry DOI: 10.7270/Q22Z15NV