BDBM50305467 2-amino-4-cyclohexyl-1-methyl-4-phenyl-1H-imidazol-5(4H)-one::CHEMBL599965
SMILES: CN1C(N)=NC(C2CCCCC2)(C1=O)c1ccccc1
InChI Key: InChIKey=FEZQZQTWDYTJPE-UHFFFAOYSA-N
Data: 4 IC50  1 EC50
Activity Spreadsheet -- Enzyme Inhibition Constant Data from BindingDB
Found 5 hits for monomerid = 50305467
Trg + Lig
Ki
nM
ΔG°
kcal/mole
IC50
nM
Kd
nM
EC50/IC50
nM
koff
s-1
kon
M-1s-1
pHTemp
°C
Beta-secretase 1
(Homo sapiens (Human))
BDBM50305467
(2-amino-4-cyclohexyl-1-methyl-4-phenyl-1H-imidazol...)
Show SMILES CN1C(N)=NC(C2CCCCC2)(C1=O)c1ccccc1 |c:3|
Show InChI InChI=1S/C16H21N3O/c1-19-14(20)16(18-15(19)17,12-8-4-2-5-9-12)13-10-6-3-7-11-13/h2,4-5,8-9,13H,3,6-7,10-11H2,1H3,(H2,17,18)
n/an/a 990n/an/an/an/an/an/a
Wyeth Research
Curated by ChEMBL
Assay Description
Inhibition of human BACE1 by FRET assay
Bioorg Med Chem Lett 20: 632-5 (2010)
Article DOI: 10.1016/j.bmcl.2009.11.052
BindingDB Entry DOI: 10.7270/Q20Z73BN
Beta-secretase 1
(Homo sapiens (Human))
BDBM50305467
(2-amino-4-cyclohexyl-1-methyl-4-phenyl-1H-imidazol...)
Show SMILES CN1C(N)=NC(C2CCCCC2)(C1=O)c1ccccc1 |c:3|
Show InChI InChI=1S/C16H21N3O/c1-19-14(20)16(18-15(19)17,12-8-4-2-5-9-12)13-10-6-3-7-11-13/h2,4-5,8-9,13H,3,6-7,10-11H2,1H3,(H2,17,18)
n/an/a 991n/an/an/an/an/an/a
Sichuan University
Curated by ChEMBL
Assay Description
Inhibition of human BACE1
Eur J Med Chem 46: 58-64 (2010)
Article DOI: 10.1016/j.ejmech.2010.10.014
BindingDB Entry DOI: 10.7270/Q2P55PRK
Beta-secretase 2
(Homo sapiens (Human))
BDBM50305467
(2-amino-4-cyclohexyl-1-methyl-4-phenyl-1H-imidazol...)
Show SMILES CN1C(N)=NC(C2CCCCC2)(C1=O)c1ccccc1 |c:3|
Show InChI InChI=1S/C16H21N3O/c1-19-14(20)16(18-15(19)17,12-8-4-2-5-9-12)13-10-6-3-7-11-13/h2,4-5,8-9,13H,3,6-7,10-11H2,1H3,(H2,17,18)
n/an/a 510n/an/an/an/an/an/a
Wyeth Research
Curated by ChEMBL
Assay Description
Inhibition of human BACE2 by FRET assay
Bioorg Med Chem Lett 20: 632-5 (2010)
Article DOI: 10.1016/j.bmcl.2009.11.052
BindingDB Entry DOI: 10.7270/Q20Z73BN
Beta amyloid A4 protein
(Homo sapiens (Human))
BDBM50305467
(2-amino-4-cyclohexyl-1-methyl-4-phenyl-1H-imidazol...)
Show SMILES CN1C(N)=NC(C2CCCCC2)(C1=O)c1ccccc1 |c:3|
Show InChI InChI=1S/C16H21N3O/c1-19-14(20)16(18-15(19)17,12-8-4-2-5-9-12)13-10-6-3-7-11-13/h2,4-5,8-9,13H,3,6-7,10-11H2,1H3,(H2,17,18)
Reactome pathway
n/an/an/an/a 810n/an/an/an/a
Wyeth Research
Curated by ChEMBL
Assay Description
Inhibition of human recombinant APP expressed in CHO-K1 cells assessed as reduction of amyloid beta level by ELISA
Bioorg Med Chem Lett 20: 632-5 (2010)
Article DOI: 10.1016/j.bmcl.2009.11.052
BindingDB Entry DOI: 10.7270/Q20Z73BN
Cathepsin D
(Homo sapiens (Human))
BDBM50305467
(2-amino-4-cyclohexyl-1-methyl-4-phenyl-1H-imidazol...)
Show SMILES CN1C(N)=NC(C2CCCCC2)(C1=O)c1ccccc1 |c:3|
Show InChI InChI=1S/C16H21N3O/c1-19-14(20)16(18-15(19)17,12-8-4-2-5-9-12)13-10-6-3-7-11-13/h2,4-5,8-9,13H,3,6-7,10-11H2,1H3,(H2,17,18)
NCI pathway
Reactome pathway
n/an/a 2.40E+4n/an/an/an/an/an/a
Wyeth Research
Curated by ChEMBL
Assay Description
Inhibition of human cathepsin D by FRET assay
Bioorg Med Chem Lett 20: 632-5 (2010)
Article DOI: 10.1016/j.bmcl.2009.11.052
BindingDB Entry DOI: 10.7270/Q20Z73BN