BDBM50305491 4-(3-(3-(isopropylsulfonyl)phenoxy)phenyl)-8-(trifluoromethyl)quinoline-3-carboxamide::CHEMBL593739
SMILES: CC(C)S(=O)(=O)c1cccc(Oc2cccc(c2)-c2c(cnc3c(cccc23)C(F)(F)F)C(N)=O)c1
InChI Key: InChIKey=BYZAOZSASXJAQT-UHFFFAOYSA-N
Data: 2 IC50
Activity Spreadsheet -- Enzyme Inhibition Constant Data from BindingDB
Found 2 hits for monomerid = 50305491
Trg + Lig
Ki
nM
ΔG°
kcal/mole
IC50
nM
Kd
nM
EC50/IC50
nM
koff
s-1
kon
M-1s-1
pHTemp
°C
Oxysterols receptor LXR-alpha
(Homo sapiens (Human))
BDBM50305491
(4-(3-(3-(isopropylsulfonyl)phenoxy)phenyl)-8-(trif...)
Show SMILES CC(C)S(=O)(=O)c1cccc(Oc2cccc(c2)-c2c(cnc3c(cccc23)C(F)(F)F)C(N)=O)c1
Show InChI InChI=1S/C26H21F3N2O4S/c1-15(2)36(33,34)19-9-4-8-18(13-19)35-17-7-3-6-16(12-17)23-20-10-5-11-22(26(27,28)29)24(20)31-14-21(23)25(30)32/h3-15H,1-2H3,(H2,30,32)
NCI pathway
Reactome pathway
n/an/a 286n/an/an/an/an/an/a
Wyeth Pharmaceuticals
Curated by ChEMBL
Assay Description
Displacement of [3H]TO901317 from human recombinant LXRalpha expressed in Escherichia coli by flashplate method
Bioorg Med Chem Lett 20: 689-93 (2010)
Article DOI: 10.1016/j.bmcl.2009.11.062
BindingDB Entry DOI: 10.7270/Q2W66KV8
Oxysterols receptor LXR-beta
(Homo sapiens (Human))
BDBM50305491
(4-(3-(3-(isopropylsulfonyl)phenoxy)phenyl)-8-(trif...)
Show SMILES CC(C)S(=O)(=O)c1cccc(Oc2cccc(c2)-c2c(cnc3c(cccc23)C(F)(F)F)C(N)=O)c1
Show InChI InChI=1S/C26H21F3N2O4S/c1-15(2)36(33,34)19-9-4-8-18(13-19)35-17-7-3-6-16(12-17)23-20-10-5-11-22(26(27,28)29)24(20)31-14-21(23)25(30)32/h3-15H,1-2H3,(H2,30,32)
n/an/a 5n/an/an/an/an/an/a
Wyeth Pharmaceuticals
Curated by ChEMBL
Assay Description
Displacement of [3H]TO901317 from human recombinant LXRbeta expressed in Escherichia coli by flashplate method
Bioorg Med Chem Lett 20: 689-93 (2010)
Article DOI: 10.1016/j.bmcl.2009.11.062
BindingDB Entry DOI: 10.7270/Q2W66KV8