BDBM50305696 3-(2,4-difluorophenyl)-6-(2,4-difluorophenylthio)-[1,2,4]triazolo[4,3-a]pyridine hydrochloride::CHEMBL592978
SMILES: Fc1ccc(Sc2ccc3nnc(-c4ccc(F)cc4F)n3c2)c(F)c1
InChI Key: InChIKey=JDWSITLLFNWXHF-UHFFFAOYSA-N
Data: 1 IC50
Activity Spreadsheet -- Enzyme Inhibition Constant Data from BindingDB
Found 1 hit for monomerid = 50305696
Trg + Lig
Ki
nM
ΔG°
kcal/mole
IC50
nM
Kd
nM
EC50/IC50
nM
koff
s-1
kon
M-1s-1
pHTemp
°C
Mitogen-activated protein kinase 14
(Homo sapiens (Human))
BDBM50305696
(3-(2,4-difluorophenyl)-6-(2,4-difluorophenylthio)-...)
Show SMILES Fc1ccc(Sc2ccc3nnc(-c4ccc(F)cc4F)n3c2)c(F)c1
Show InChI InChI=1S/C18H9F4N3S/c19-10-1-4-13(14(21)7-10)18-24-23-17-6-3-12(9-25(17)18)26-16-5-2-11(20)8-15(16)22/h1-9H
NCI pathway
Reactome pathway
n/an/a 7.20n/an/an/an/an/an/a
Pfizer Global Research and Development
Curated by ChEMBL
Assay Description
Inhibition of p38 alpha
Bioorg Med Chem Lett 20: 469-73 (2010)
Article DOI: 10.1016/j.bmcl.2009.11.114
BindingDB Entry DOI: 10.7270/Q2G160XP