BDBM50305877 6-(4-methoxyphenyl)-5-methyl-3-(pyridin-4-yl)isoxazolo[4,5-c]pyridin-4(5H)-one::CHEMBL593489
SMILES: COc1ccc(cc1)-c1cc2onc(-c3ccncc3)c2c(=O)n1C
InChI Key: InChIKey=PDWYBOZNEVALOV-UHFFFAOYSA-N
Data: 1 IC50
Activity Spreadsheet -- Enzyme Inhibition Constant Data from BindingDB
Found 1 hit for monomerid = 50305877
Trg + Lig
Ki
nM
ΔG°
kcal/mole
IC50
nM
Kd
nM
EC50/IC50
nM
koff
s-1
kon
M-1s-1
pHTemp
°C
Metabotropic glutamate receptor 7
(Rattus norvegicus (Rat))
BDBM50305877
(6-(4-methoxyphenyl)-5-methyl-3-(pyridin-4-yl)isoxa...)
Show SMILES COc1ccc(cc1)-c1cc2onc(-c3ccncc3)c2c(=O)n1C
Show InChI InChI=1S/C19H15N3O3/c1-22-15(12-3-5-14(24-2)6-4-12)11-16-17(19(22)23)18(21-25-16)13-7-9-20-10-8-13/h3-11H,1-2H3
n/an/a 26n/an/an/an/an/an/a
Banyu Tsukuba Research Institute
Curated by ChEMBL
Assay Description
Antagonist activity at rat mGluR7 expressed in CHO cells assessed as inhibition of LAP-induced intracellular calcium mobilization by FLIPR
Bioorg Med Chem Lett 20: 726-9 (2010)
Article DOI: 10.1016/j.bmcl.2009.11.070
BindingDB Entry DOI: 10.7270/Q2F18ZSX