null
SMILES: CC(C)[C@H](C(=O)Nc1ccccn1)c1ccc(Cl)cc1
InChI Key: InChIKey=CJFOXMFRJCLYKE-HNNXBMFYSA-N
Activity Spreadsheet -- Enzyme Inhibition Constant Data from BindingDB
Found 1 hit for monomerid = 50305949
Trg + Lig
Ki
nM
ΔG°
kcal/mole
IC50
nM
Kd
nM
EC50/IC50
nM
koff
s-1
kon
M-1s-1
pHTemp
°C
Free fatty acid receptor 2
(Homo sapiens (Human))
BDBM50305949
((S)-2-(4-chlorophenyl)-3-methyl-N-(pyridin-2-yl)bu...)
Show SMILES CC(C)[C@H](C(=O)Nc1ccccn1)c1ccc(Cl)cc1 |r|
Show InChI InChI=1S/C16H17ClN2O/c1-11(2)15(12-6-8-13(17)9-7-12)16(20)19-14-5-3-4-10-18-14/h3-11,15H,1-2H3,(H,18,19,20)/t15-/m0/s1
Reactome pathway
n/an/a 1.40E+3n/an/an/an/an/an/a
Amgen Inc.
Curated by ChEMBL
Assay Description
Agonist activity at human FFA2 receptor expressed in CHO cells assessed as inhibition of forskolin-induced cAMP production
Bioorg Med Chem Lett 20: 493-8 (2010)
Article DOI: 10.1016/j.bmcl.2009.11.112
BindingDB Entry DOI: 10.7270/Q21V5F2Q