null
SMILES: CC(C)[C@H](C(=O)Nc1ncns1)c1ccc(Cl)cc1
InChI Key: InChIKey=XDANLFKHPZZFFO-NSHDSACASA-N
Activity Spreadsheet -- Enzyme Inhibition Constant Data from BindingDB
Found 1 hit for monomerid = 50305958
Trg + Lig
Ki
nM
ΔG°
kcal/mole
IC50
nM
Kd
nM
EC50/IC50
nM
koff
s-1
kon
M-1s-1
pHTemp
°C
Free fatty acid receptor 2
(Homo sapiens (Human))
BDBM50305958
((S)-2-(4-chlorophenyl)-3-methyl-N-(1,2,4-thiadiazo...)
Show SMILES CC(C)[C@H](C(=O)Nc1ncns1)c1ccc(Cl)cc1 |r|
Show InChI InChI=1S/C13H14ClN3OS/c1-8(2)11(9-3-5-10(14)6-4-9)12(18)17-13-15-7-16-19-13/h3-8,11H,1-2H3,(H,15,16,17,18)/t11-/m0/s1
Reactome pathway
n/an/a 2.00E+3n/an/an/an/an/an/a
Amgen Inc.
Curated by ChEMBL
Assay Description
Agonist activity at human FFA2 receptor expressed in CHO cells assessed as inhibition of forskolin-induced cAMP production
Bioorg Med Chem Lett 20: 493-8 (2010)
Article DOI: 10.1016/j.bmcl.2009.11.112
BindingDB Entry DOI: 10.7270/Q21V5F2Q