null
SMILES: CC(C)[C@H](C(=O)NC1=NCCS1)c1ccc(Cl)cc1
InChI Key: InChIKey=BDZXBWOFMCKTQQ-LBPRGKRZSA-N
Activity Spreadsheet -- Enzyme Inhibition Constant Data from BindingDB
Found 1 hit for monomerid = 50305964
Trg + Lig
Ki
nM
ΔG°
kcal/mole
IC50
nM
Kd
nM
EC50/IC50
nM
koff
s-1
kon
M-1s-1
pHTemp
°C
Free fatty acid receptor 2
(Homo sapiens (Human))
BDBM50305964
((S)-2-(4-chlorophenyl)-N-(4,5-dihydrothiazol-2-yl)...)
Show SMILES CC(C)[C@H](C(=O)NC1=NCCS1)c1ccc(Cl)cc1 |r,t:7|
Show InChI InChI=1S/C14H17ClN2OS/c1-9(2)12(10-3-5-11(15)6-4-10)13(18)17-14-16-7-8-19-14/h3-6,9,12H,7-8H2,1-2H3,(H,16,17,18)/t12-/m0/s1
Reactome pathway
n/an/a 2.10E+3n/an/an/an/an/an/a
Amgen Inc.
Curated by ChEMBL
Assay Description
Agonist activity at human FFA2 receptor expressed in CHO cells assessed as inhibition of forskolin-induced cAMP production
Bioorg Med Chem Lett 20: 493-8 (2010)
Article DOI: 10.1016/j.bmcl.2009.11.112
BindingDB Entry DOI: 10.7270/Q21V5F2Q