BDBM50305966 CHEMBL609852::rac-N-(benzo[d]thiazol-2-yl)-2-(4-chlorophenyl)-3-methylbutanamide
SMILES: CC(C)C(C(=O)Nc1nc2ccccc2s1)c1ccc(Cl)cc1
InChI Key: InChIKey=JSPSFVSQBCVECE-UHFFFAOYSA-N
Data: 1 IC50
Activity Spreadsheet -- Enzyme Inhibition Constant Data from BindingDB
Found 1 hit for monomerid = 50305966
Trg + Lig
Ki
nM
ΔG°
kcal/mole
IC50
nM
Kd
nM
EC50/IC50
nM
koff
s-1
kon
M-1s-1
pHTemp
°C
Free fatty acid receptor 2
(Homo sapiens (Human))
BDBM50305966
(CHEMBL609852 | rac-N-(benzo[d]thiazol-2-yl)-2-(4-c...)
Show SMILES CC(C)C(C(=O)Nc1nc2ccccc2s1)c1ccc(Cl)cc1
Show InChI InChI=1S/C18H17ClN2OS/c1-11(2)16(12-7-9-13(19)10-8-12)17(22)21-18-20-14-5-3-4-6-15(14)23-18/h3-11,16H,1-2H3,(H,20,21,22)
Reactome pathway
n/an/a 3.00E+3n/an/an/an/an/an/a
Amgen Inc.
Curated by ChEMBL
Assay Description
Agonist activity at human FFA2 receptor expressed in CHO cells assessed as inhibition of forskolin-induced cAMP production
Bioorg Med Chem Lett 20: 493-8 (2010)
Article DOI: 10.1016/j.bmcl.2009.11.112
BindingDB Entry DOI: 10.7270/Q21V5F2Q