BDBM50306001 1,1,1-trifluoro-N-(6-(2-(pyridin-2-ylsulfonyl)phenylsulfonyl)-6-azaspiro[2.5]octan-1-yl)methanesulfonamide::CHEMBL592895
SMILES: FC(F)(F)S(=O)(=O)NC1CC11CCN(CC1)S(=O)(=O)c1ccccc1S(=O)(=O)c1ccccn1
InChI Key: InChIKey=WQARJMVGKJSAPT-UHFFFAOYSA-N
Data: 1 KI  1 IC50
Activity Spreadsheet -- Enzyme Inhibition Constant Data from BindingDB
Found 2 hits for monomerid = 50306001
Trg + Lig
Ki
nM
ΔG°
kcal/mole
IC50
nM
Kd
nM
EC50/IC50
nM
koff
s-1
kon
M-1s-1
pHTemp
°C
Cannabinoid receptor 2
(Homo sapiens (Human))
BDBM50306001
(1,1,1-trifluoro-N-(6-(2-(pyridin-2-ylsulfonyl)phen...)
Show SMILES FC(F)(F)S(=O)(=O)NC1CC11CCN(CC1)S(=O)(=O)c1ccccc1S(=O)(=O)c1ccccn1
Show InChI InChI=1S/C19H20F3N3O6S3/c20-19(21,22)34(30,31)24-16-13-18(16)8-11-25(12-9-18)33(28,29)15-6-2-1-5-14(15)32(26,27)17-7-3-4-10-23-17/h1-7,10,16,24H,8-9,11-13H2
Reactome pathway
11n/an/an/an/an/an/an/an/a
Merck Research Laboratories
Curated by ChEMBL
Assay Description
Binding affinity to human CB2 receptor
Bioorg Med Chem Lett 20: 608-11 (2010)
Article DOI: 10.1016/j.bmcl.2009.11.084
BindingDB Entry DOI: 10.7270/Q2SB45V0
Cytochrome P450 2C9
(Homo sapiens (Human))
BDBM50306001
(1,1,1-trifluoro-N-(6-(2-(pyridin-2-ylsulfonyl)phen...)
Show SMILES FC(F)(F)S(=O)(=O)NC1CC11CCN(CC1)S(=O)(=O)c1ccccc1S(=O)(=O)c1ccccn1
Show InChI InChI=1S/C19H20F3N3O6S3/c20-19(21,22)34(30,31)24-16-13-18(16)8-11-25(12-9-18)33(28,29)15-6-2-1-5-14(15)32(26,27)17-7-3-4-10-23-17/h1-7,10,16,24H,8-9,11-13H2
Reactome pathway
n/an/a 3.00E+4n/an/an/an/an/an/a
Merck Research Laboratories
Curated by ChEMBL
Assay Description
Inhibition of CYP2C9
Bioorg Med Chem Lett 20: 608-11 (2010)
Article DOI: 10.1016/j.bmcl.2009.11.084
BindingDB Entry DOI: 10.7270/Q2SB45V0