BDBM50306004 1,1,1-trifluoro-N-(6-(2-(pyridin-2-ylsulfonyl)-5-(trifluoromethyl)phenylsulfonyl)-6-azaspiro[2.5]octan-1-yl)methanesulfonamide::CHEMBL596135
SMILES: FC(F)(F)c1ccc(c(c1)S(=O)(=O)N1CCC2(CC2NS(=O)(=O)C(F)(F)F)CC1)S(=O)(=O)c1ccccn1
InChI Key: InChIKey=IEEFYXFSZIMIJN-UHFFFAOYSA-N
Data: 1 KI  1 IC50
Activity Spreadsheet -- Enzyme Inhibition Constant Data from BindingDB
Found 2 hits for monomerid = 50306004
Trg + Lig
Ki
nM
ΔG°
kcal/mole
IC50
nM
Kd
nM
EC50/IC50
nM
koff
s-1
kon
M-1s-1
pHTemp
°C
Cannabinoid receptor 2
(Homo sapiens (Human))
BDBM50306004
(1,1,1-trifluoro-N-(6-(2-(pyridin-2-ylsulfonyl)-5-(...)
Show SMILES FC(F)(F)c1ccc(c(c1)S(=O)(=O)N1CCC2(CC2NS(=O)(=O)C(F)(F)F)CC1)S(=O)(=O)c1ccccn1
Show InChI InChI=1S/C20H19F6N3O6S3/c21-19(22,23)13-4-5-14(36(30,31)17-3-1-2-8-27-17)15(11-13)37(32,33)29-9-6-18(7-10-29)12-16(18)28-38(34,35)20(24,25)26/h1-5,8,11,16,28H,6-7,9-10,12H2
Reactome pathway
5n/an/an/an/an/an/an/an/a
Merck Research Laboratories
Curated by ChEMBL
Assay Description
Binding affinity to human CB2 receptor
Bioorg Med Chem Lett 20: 608-11 (2010)
Article DOI: 10.1016/j.bmcl.2009.11.084
BindingDB Entry DOI: 10.7270/Q2SB45V0
Cytochrome P450 2C9
(Homo sapiens (Human))
BDBM50306004
(1,1,1-trifluoro-N-(6-(2-(pyridin-2-ylsulfonyl)-5-(...)
Show SMILES FC(F)(F)c1ccc(c(c1)S(=O)(=O)N1CCC2(CC2NS(=O)(=O)C(F)(F)F)CC1)S(=O)(=O)c1ccccn1
Show InChI InChI=1S/C20H19F6N3O6S3/c21-19(22,23)13-4-5-14(36(30,31)17-3-1-2-8-27-17)15(11-13)37(32,33)29-9-6-18(7-10-29)12-16(18)28-38(34,35)20(24,25)26/h1-5,8,11,16,28H,6-7,9-10,12H2
Reactome pathway
n/an/a 1.00E+3n/an/an/an/an/an/a
Merck Research Laboratories
Curated by ChEMBL
Assay Description
Inhibition of CYP2C9
Bioorg Med Chem Lett 20: 608-11 (2010)
Article DOI: 10.1016/j.bmcl.2009.11.084
BindingDB Entry DOI: 10.7270/Q2SB45V0