BDBM50306170 5-fluoro-2-(4-(1-methylazetidine-3-carboxamido)phenyl)-2H-indazole-7-carboxamide::CHEMBL595925
SMILES: CN1CC(C1)C(=O)Nc1ccc(cc1)-n1cc2cc(F)cc(C(N)=O)c2n1
InChI Key: InChIKey=JQHFHQQWFDGVTF-UHFFFAOYSA-N
Data: 1 IC50
Activity Spreadsheet -- Enzyme Inhibition Constant Data from BindingDB
Found 1 hit for monomerid = 50306170
Trg + Lig
Ki
nM
ΔG°
kcal/mole
IC50
nM
Kd
nM
EC50/IC50
nM
koff
s-1
kon
M-1s-1
pHTemp
°C
Poly [ADP-ribose] polymerase 1
(Homo sapiens (Human))
BDBM50306170
(5-fluoro-2-(4-(1-methylazetidine-3-carboxamido)phe...)
Show SMILES CN1CC(C1)C(=O)Nc1ccc(cc1)-n1cc2cc(F)cc(C(N)=O)c2n1
Show InChI InChI=1S/C19H18FN5O2/c1-24-8-12(9-24)19(27)22-14-2-4-15(5-3-14)25-10-11-6-13(20)7-16(18(21)26)17(11)23-25/h2-7,10,12H,8-9H2,1H3,(H2,21,26)(H,22,27)
n/an/a 6n/an/an/an/an/an/a
IRBM-Merck Research Laboratories Rome
Curated by ChEMBL
Assay Description
Inhibition of human PARP1 after 3 hrs using [3H]NAD+ by scintillation proximity assay
Bioorg Med Chem Lett 20: 488-92 (2010)
Article DOI: 10.1016/j.bmcl.2009.11.127
BindingDB Entry DOI: 10.7270/Q2W37WFZ