BDBM50306186 2-(3-methoxy-4-((methylamino)methyl)phenyl)-2H-indazole-7-carboxamide::CHEMBL593828
SMILES: CNCc1ccc(cc1OC)-n1cc2cccc(C(N)=O)c2n1
InChI Key: InChIKey=RMXNYGKHLCDIQU-UHFFFAOYSA-N
Data: 1 IC50
Activity Spreadsheet -- Enzyme Inhibition Constant Data from BindingDB
Found 1 hit for monomerid = 50306186
Trg + Lig
Ki
nM
ΔG°
kcal/mole
IC50
nM
Kd
nM
EC50/IC50
nM
koff
s-1
kon
M-1s-1
pHTemp
°C
Poly [ADP-ribose] polymerase 1
(Homo sapiens (Human))
BDBM50306186
(2-(3-methoxy-4-((methylamino)methyl)phenyl)-2H-ind...)
Show SMILES CNCc1ccc(cc1OC)-n1cc2cccc(C(N)=O)c2n1
Show InChI InChI=1S/C17H18N4O2/c1-19-9-11-6-7-13(8-15(11)23-2)21-10-12-4-3-5-14(17(18)22)16(12)20-21/h3-8,10,19H,9H2,1-2H3,(H2,18,22)
n/an/a 4n/an/an/an/an/an/a
IRBM-Merck Research Laboratories Rome
Curated by ChEMBL
Assay Description
Inhibition of human PARP1 after 3 hrs using [3H]NAD+ by scintillation proximity assay
Bioorg Med Chem Lett 20: 488-92 (2010)
Article DOI: 10.1016/j.bmcl.2009.11.127
BindingDB Entry DOI: 10.7270/Q2W37WFZ