BDBM50306196 2-(4-(1-methylpiperidine-4-carboxamido)phenyl)-2H-indazole-7-carboxamide::CHEMBL594369
SMILES: CN1CCC(CC1)C(=O)Nc1ccc(cc1)-n1cc2cccc(C(N)=O)c2n1
InChI Key: InChIKey=DZORYJZYAWVJHD-UHFFFAOYSA-N
Data: 1 IC50
Activity Spreadsheet -- Enzyme Inhibition Constant Data from BindingDB
Found 1 hit for monomerid = 50306196
Trg + Lig
Ki
nM
ΔG°
kcal/mole
IC50
nM
Kd
nM
EC50/IC50
nM
koff
s-1
kon
M-1s-1
pHTemp
°C
Poly [ADP-ribose] polymerase 1
(Homo sapiens (Human))
BDBM50306196
(2-(4-(1-methylpiperidine-4-carboxamido)phenyl)-2H-...)
Show SMILES CN1CCC(CC1)C(=O)Nc1ccc(cc1)-n1cc2cccc(C(N)=O)c2n1
Show InChI InChI=1S/C21H23N5O2/c1-25-11-9-14(10-12-25)21(28)23-16-5-7-17(8-6-16)26-13-15-3-2-4-18(20(22)27)19(15)24-26/h2-8,13-14H,9-12H2,1H3,(H2,22,27)(H,23,28)
n/an/a 10n/an/an/an/an/an/a
IRBM-Merck Research Laboratories Rome
Curated by ChEMBL
Assay Description
Inhibition of human PARP1 after 3 hrs using [3H]NAD+ by scintillation proximity assay
Bioorg Med Chem Lett 20: 488-92 (2010)
Article DOI: 10.1016/j.bmcl.2009.11.127
BindingDB Entry DOI: 10.7270/Q2W37WFZ