BDBM50306264 1-(2-(piperidin-1-yl)acetyl)-2,3,9,9a-tetrahydro-1H-benzo[de][1,7]naphthyridin-7(8H)-one::CHEMBL611322
SMILES: O=C(CN1CCCCC1)N1CCc2cccc3C(=O)NCC1c23
InChI Key: InChIKey=DJCHWVDAPJYQPQ-UHFFFAOYSA-N
Data: 1 IC50  1 EC50
Activity Spreadsheet -- Enzyme Inhibition Constant Data from BindingDB
Found 2 hits for monomerid = 50306264
Trg + Lig
Ki
nM
ΔG°
kcal/mole
IC50
nM
Kd
nM
EC50/IC50
nM
koff
s-1
kon
M-1s-1
pHTemp
°C
Poly [ADP-ribose] polymerase 1
(Homo sapiens (Human))
BDBM50306264
(1-(2-(piperidin-1-yl)acetyl)-2,3,9,9a-tetrahydro-1...)
Show SMILES O=C(CN1CCCCC1)N1CCc2cccc3C(=O)NCC1c23
Show InChI InChI=1S/C18H23N3O2/c22-16(12-20-8-2-1-3-9-20)21-10-7-13-5-4-6-14-17(13)15(21)11-19-18(14)23/h4-6,15H,1-3,7-12H2,(H,19,23)
n/an/a 6n/an/an/an/an/an/a
IRBM-Merck Research Laboratories Rome
Curated by ChEMBL
Assay Description
Inhibition of human PARP1 by scintillation proximity assay
Bioorg Med Chem Lett 20: 448-52 (2010)
Article DOI: 10.1016/j.bmcl.2009.12.002
BindingDB Entry DOI: 10.7270/Q2GT5N91
Poly [ADP-ribose] polymerase 1
(Homo sapiens (Human))
BDBM50306264
(1-(2-(piperidin-1-yl)acetyl)-2,3,9,9a-tetrahydro-1...)
Show SMILES O=C(CN1CCCCC1)N1CCc2cccc3C(=O)NCC1c23
Show InChI InChI=1S/C18H23N3O2/c22-16(12-20-8-2-1-3-9-20)21-10-7-13-5-4-6-14-17(13)15(21)11-19-18(14)23/h4-6,15H,1-3,7-12H2,(H,19,23)
n/an/an/an/a 280n/an/an/an/a
IRBM-Merck Research Laboratories Rome
Curated by ChEMBL
Assay Description
Inhibition of PARP1 in human HeLa cells assessed as inhibition of hydrogen peroxide-induced poly(ADP-ribosyl)ation
Bioorg Med Chem Lett 20: 448-52 (2010)
Article DOI: 10.1016/j.bmcl.2009.12.002
BindingDB Entry DOI: 10.7270/Q2GT5N91