BDBM50306301 3-(1-(cyclopropylmethyl)-4-(4-(3-hydroxypentan-3-yl)phenyl)piperidin-4-yl)benzamide::CHEMBL593583
SMILES: CCC(O)(CC)c1ccc(cc1)C1(CCN(CC2CC2)CC1)c1cccc(c1)C(N)=O
InChI Key: InChIKey=NSZMMTQRGQBJNB-UHFFFAOYSA-N
Data: 3 KI  1 IC50
Activity Spreadsheet -- Enzyme Inhibition Constant Data from BindingDB
Found 4 hits for monomerid = 50306301
Trg + Lig
Ki
nM
ΔG°
kcal/mole
IC50
nM
Kd
nM
EC50/IC50
nM
koff
s-1
kon
M-1s-1
pHTemp
°C
Delta-type opioid receptor
(Homo sapiens (Human))
BDBM50306301
(3-(1-(cyclopropylmethyl)-4-(4-(3-hydroxypentan-3-y...)
Show SMILES CCC(O)(CC)c1ccc(cc1)C1(CCN(CC2CC2)CC1)c1cccc(c1)C(N)=O
Show InChI InChI=1S/C27H36N2O2/c1-3-27(31,4-2)23-12-10-22(11-13-23)26(24-7-5-6-21(18-24)25(28)30)14-16-29(17-15-26)19-20-8-9-20/h5-7,10-13,18,20,31H,3-4,8-9,14-17,19H2,1-2H3,(H2,28,30)
Reactome pathway
2.30n/an/an/an/an/an/an/an/a
Pfizer Global Research and Development
Curated by ChEMBL
Assay Description
Displacement of [125I]diprenorphine from human delta opioid receptor expressed in CHO cells by liquid scintillation counting
Bioorg Med Chem Lett 20: 503-7 (2010)
Article DOI: 10.1016/j.bmcl.2009.11.113
BindingDB Entry DOI: 10.7270/Q2C53KX1
Kappa-type opioid receptor
(Homo sapiens (Human))
BDBM50306301
(3-(1-(cyclopropylmethyl)-4-(4-(3-hydroxypentan-3-y...)
Show SMILES CCC(O)(CC)c1ccc(cc1)C1(CCN(CC2CC2)CC1)c1cccc(c1)C(N)=O
Show InChI InChI=1S/C27H36N2O2/c1-3-27(31,4-2)23-12-10-22(11-13-23)26(24-7-5-6-21(18-24)25(28)30)14-16-29(17-15-26)19-20-8-9-20/h5-7,10-13,18,20,31H,3-4,8-9,14-17,19H2,1-2H3,(H2,28,30)
Reactome pathway
79n/an/an/an/an/an/an/an/a
Pfizer Global Research and Development
Curated by ChEMBL
Assay Description
Displacement of [125I]diprenorphine from human kappa opioid receptor expressed in CHO cells by liquid scintillation counting
Bioorg Med Chem Lett 20: 503-7 (2010)
Article DOI: 10.1016/j.bmcl.2009.11.113
BindingDB Entry DOI: 10.7270/Q2C53KX1
Mu-type opioid receptor
(Homo sapiens (Human))
BDBM50306301
(3-(1-(cyclopropylmethyl)-4-(4-(3-hydroxypentan-3-y...)
Show SMILES CCC(O)(CC)c1ccc(cc1)C1(CCN(CC2CC2)CC1)c1cccc(c1)C(N)=O
Show InChI InChI=1S/C27H36N2O2/c1-3-27(31,4-2)23-12-10-22(11-13-23)26(24-7-5-6-21(18-24)25(28)30)14-16-29(17-15-26)19-20-8-9-20/h5-7,10-13,18,20,31H,3-4,8-9,14-17,19H2,1-2H3,(H2,28,30)
NCI pathway
Reactome pathway
>890n/an/an/an/an/an/an/an/a
Pfizer Global Research and Development
Curated by ChEMBL
Assay Description
Displacement of [125I]diprenorphine from human mu opioid receptor expressed in CHO cells by liquid scintillation counting
Bioorg Med Chem Lett 20: 503-7 (2010)
Article DOI: 10.1016/j.bmcl.2009.11.113
BindingDB Entry DOI: 10.7270/Q2C53KX1
Delta-type opioid receptor
(Homo sapiens (Human))
BDBM50306301
(3-(1-(cyclopropylmethyl)-4-(4-(3-hydroxypentan-3-y...)
Show SMILES CCC(O)(CC)c1ccc(cc1)C1(CCN(CC2CC2)CC1)c1cccc(c1)C(N)=O
Show InChI InChI=1S/C27H36N2O2/c1-3-27(31,4-2)23-12-10-22(11-13-23)26(24-7-5-6-21(18-24)25(28)30)14-16-29(17-15-26)19-20-8-9-20/h5-7,10-13,18,20,31H,3-4,8-9,14-17,19H2,1-2H3,(H2,28,30)
Reactome pathway
n/an/a 282n/an/an/an/an/an/a
Pfizer Global Research and Development
Curated by ChEMBL
Assay Description
Antagonist activity at delta opioid receptor by GTPgammaS bunding assay
Bioorg Med Chem Lett 20: 503-7 (2010)
Article DOI: 10.1016/j.bmcl.2009.11.113
BindingDB Entry DOI: 10.7270/Q2C53KX1