BDBM50306514 4'-((2,3-dimethyl-5-(3-phenylpropylcarbamoyl)-1H-indol-1-yl)methyl)biphenyl-2-carboxylic acid::CHEMBL602670
SMILES: Cc1c(C)c2cc(ccc2n1Cc1ccc(cc1)-c1ccccc1C(O)=O)C(=O)NCCCc1ccccc1
InChI Key: InChIKey=CBRDFXWDCHPLBG-UHFFFAOYSA-N
Data: 3 IC50  3 EC50
Activity Spreadsheet -- Enzyme Inhibition Constant Data from BindingDB
Found 6 hits for monomerid = 50306514
Trg + Lig
Ki
nM
ΔG°
kcal/mole
IC50
nM
Kd
nM
EC50/IC50
nM
koff
s-1
kon
M-1s-1
pHTemp
°C
Peroxisome proliferator-activated receptor delta
(Homo sapiens (Human))
BDBM50306514
(4'-((2,3-dimethyl-5-(3-phenylpropylcarbamoyl)-1H-i...)
Show SMILES Cc1c(C)c2cc(ccc2n1Cc1ccc(cc1)-c1ccccc1C(O)=O)C(=O)NCCCc1ccccc1
Show InChI InChI=1S/C34H32N2O3/c1-23-24(2)36(22-26-14-16-27(17-15-26)29-12-6-7-13-30(29)34(38)39)32-19-18-28(21-31(23)32)33(37)35-20-8-11-25-9-4-3-5-10-25/h3-7,9-10,12-19,21H,8,11,20,22H2,1-2H3,(H,35,37)(H,38,39)
n/an/a>1.00E+4n/an/an/an/an/an/a
Centre de Recherches
Curated by ChEMBL
Assay Description
Displacement of radiolabled GW2433 from human PPARdelta ligand binding domain expressed in Escherichia coli
Bioorg Med Chem Lett 20: 1399-404 (2010)
Article DOI: 10.1016/j.bmcl.2009.12.107
BindingDB Entry DOI: 10.7270/Q2T43T5R
Peroxisome proliferator-activated receptor alpha (PPAR alpha)
(Homo sapiens (Human))
BDBM50306514
(4'-((2,3-dimethyl-5-(3-phenylpropylcarbamoyl)-1H-i...)
Show SMILES Cc1c(C)c2cc(ccc2n1Cc1ccc(cc1)-c1ccccc1C(O)=O)C(=O)NCCCc1ccccc1
Show InChI InChI=1S/C34H32N2O3/c1-23-24(2)36(22-26-14-16-27(17-15-26)29-12-6-7-13-30(29)34(38)39)32-19-18-28(21-31(23)32)33(37)35-20-8-11-25-9-4-3-5-10-25/h3-7,9-10,12-19,21H,8,11,20,22H2,1-2H3,(H,35,37)(H,38,39)
n/an/a>1.00E+4n/an/an/an/an/an/a
Centre de Recherches
Curated by ChEMBL
Assay Description
Displacement of radiolabled GW2433 from human PPARalpha ligand binding domain expressed in Escherichia coli
Bioorg Med Chem Lett 20: 1399-404 (2010)
Article DOI: 10.1016/j.bmcl.2009.12.107
BindingDB Entry DOI: 10.7270/Q2T43T5R
Peroxisome proliferator-activated receptor
(Homo sapiens (Human))
BDBM50306514
(4'-((2,3-dimethyl-5-(3-phenylpropylcarbamoyl)-1H-i...)
Show SMILES Cc1c(C)c2cc(ccc2n1Cc1ccc(cc1)-c1ccccc1C(O)=O)C(=O)NCCCc1ccccc1
Show InChI InChI=1S/C34H32N2O3/c1-23-24(2)36(22-26-14-16-27(17-15-26)29-12-6-7-13-30(29)34(38)39)32-19-18-28(21-31(23)32)33(37)35-20-8-11-25-9-4-3-5-10-25/h3-7,9-10,12-19,21H,8,11,20,22H2,1-2H3,(H,35,37)(H,38,39)
NCI pathway
Reactome pathway
n/an/a 18n/an/an/an/an/an/a
Centre de Recherches
Curated by ChEMBL
Assay Description
Displacement of radiolabled ((5-{4-[Methyl-pyridin-2yl-amino)-ethoxy]-benzyl}-thiazolidine-2,4-dione) from human PPARgamma ligand binding domain expr...
Bioorg Med Chem Lett 20: 1399-404 (2010)
Article DOI: 10.1016/j.bmcl.2009.12.107
BindingDB Entry DOI: 10.7270/Q2T43T5R
Peroxisome proliferator-activated receptor alpha (PPAR alpha)
(Homo sapiens (Human))
BDBM50306514
(4'-((2,3-dimethyl-5-(3-phenylpropylcarbamoyl)-1H-i...)
Show SMILES Cc1c(C)c2cc(ccc2n1Cc1ccc(cc1)-c1ccccc1C(O)=O)C(=O)NCCCc1ccccc1
Show InChI InChI=1S/C34H32N2O3/c1-23-24(2)36(22-26-14-16-27(17-15-26)29-12-6-7-13-30(29)34(38)39)32-19-18-28(21-31(23)32)33(37)35-20-8-11-25-9-4-3-5-10-25/h3-7,9-10,12-19,21H,8,11,20,22H2,1-2H3,(H,35,37)(H,38,39)
n/an/an/an/a>1.00E+4n/an/an/an/a
Centre de Recherches
Curated by ChEMBL
Assay Description
Agonist activity at human PPARalpha expressed in african green monkey CV1 cells by Gal4 transactivation assay
Bioorg Med Chem Lett 20: 1399-404 (2010)
Article DOI: 10.1016/j.bmcl.2009.12.107
BindingDB Entry DOI: 10.7270/Q2T43T5R
Peroxisome proliferator-activated receptor
(Homo sapiens (Human))
BDBM50306514
(4'-((2,3-dimethyl-5-(3-phenylpropylcarbamoyl)-1H-i...)
Show SMILES Cc1c(C)c2cc(ccc2n1Cc1ccc(cc1)-c1ccccc1C(O)=O)C(=O)NCCCc1ccccc1
Show InChI InChI=1S/C34H32N2O3/c1-23-24(2)36(22-26-14-16-27(17-15-26)29-12-6-7-13-30(29)34(38)39)32-19-18-28(21-31(23)32)33(37)35-20-8-11-25-9-4-3-5-10-25/h3-7,9-10,12-19,21H,8,11,20,22H2,1-2H3,(H,35,37)(H,38,39)
NCI pathway
Reactome pathway
n/an/an/an/a 22n/an/an/an/a
Centre de Recherches
Curated by ChEMBL
Assay Description
Agonist activity at human PPARgamma expressed in african green monkey CV1 cells by Gal4 transactivation assay
Bioorg Med Chem Lett 20: 1399-404 (2010)
Article DOI: 10.1016/j.bmcl.2009.12.107
BindingDB Entry DOI: 10.7270/Q2T43T5R
Peroxisome proliferator-activated receptor delta
(Homo sapiens (Human))
BDBM50306514
(4'-((2,3-dimethyl-5-(3-phenylpropylcarbamoyl)-1H-i...)
Show SMILES Cc1c(C)c2cc(ccc2n1Cc1ccc(cc1)-c1ccccc1C(O)=O)C(=O)NCCCc1ccccc1
Show InChI InChI=1S/C34H32N2O3/c1-23-24(2)36(22-26-14-16-27(17-15-26)29-12-6-7-13-30(29)34(38)39)32-19-18-28(21-31(23)32)33(37)35-20-8-11-25-9-4-3-5-10-25/h3-7,9-10,12-19,21H,8,11,20,22H2,1-2H3,(H,35,37)(H,38,39)
n/an/an/an/a>1.00E+4n/an/an/an/a
Centre de Recherches
Curated by ChEMBL
Assay Description
Agonist activity at human PPARdelta expressed in african green monkey CV1 cells by Gal4 transactivation assay
Bioorg Med Chem Lett 20: 1399-404 (2010)
Article DOI: 10.1016/j.bmcl.2009.12.107
BindingDB Entry DOI: 10.7270/Q2T43T5R