null
SMILES: COc1c(O)ccc2c1cc([N+]([O-])=O)c1c(cc3OCOc3c21)C(O)=O
InChI Key: InChIKey=UCLGCTLOEZZSLA-UHFFFAOYSA-N
PDB links: 2 PDB IDs match this monomer.
Activity Spreadsheet -- Enzyme Inhibition Constant Data from BindingDB
Found 1 hit for monomerid = 50306859
Trg + Lig
Ki
nM
ΔG°
kcal/mole
IC50
nM
Kd
nM
EC50/IC50
nM
koff
s-1
kon
M-1s-1
pHTemp
°C
Cyclin-dependent kinase 2
(Homo sapiens (Human))
BDBM50306859
(7-hydroxy aristolochic A | 9-HYDROXY ARISTOLOCHIC ...)
Show SMILES COc1c(O)ccc2c1cc([N+]([O-])=O)c1c(cc3OCOc3c21)C(O)=O
Show InChI InChI=1S/C17H11NO8/c1-24-15-8-4-10(18(22)23)13-9(17(20)21)5-12-16(26-6-25-12)14(13)7(8)2-3-11(15)19/h2-5,19H,6H2,1H3,(H,20,21)
NCI pathway
Reactome pathway
n/an/a 2.50E+4n/an/an/an/an/an/a
Schering Plough Research Institute
Curated by ChEMBL
Assay Description
Inhibition of CDK2
Bioorg Med Chem Lett 20: 1384-7 (2010)
Article DOI: 10.1016/j.bmcl.2010.01.007
BindingDB Entry DOI: 10.7270/Q2QF8TTB