BDBM50306874 8-Hydroxy-6H-benzo[f][1,3]dioxolo[4',5':4,5]benzo[1,2,3-cd]indol-5-one::CHEMBL609040::SCH-535270
SMILES: Oc1cccc2c1cc1NC(=O)c3cc4OCOc4c2c13
InChI Key: InChIKey=OVACCXPNQSWBBB-UHFFFAOYSA-N
Data: 4 IC50
Activity Spreadsheet -- Enzyme Inhibition Constant Data from BindingDB
Found 4 hits for monomerid = 50306874
Trg + Lig
Ki
nM
ΔG°
kcal/mole
IC50
nM
Kd
nM
EC50/IC50
nM
koff
s-1
kon
M-1s-1
pHTemp
°C
Cyclin-dependent kinase 1
(Homo sapiens (Human))
BDBM50306874
(8-Hydroxy-6H-benzo[f][1,3]dioxolo[4',5':4,5]benzo[...)
Show SMILES Oc1cccc2c1cc1NC(=O)c3cc4OCOc4c2c13
Show InChI InChI=1S/C16H9NO4/c18-11-3-1-2-7-8(11)4-10-13-9(16(19)17-10)5-12-15(14(7)13)21-6-20-12/h1-5,18H,6H2,(H,17,19)
Reactome pathway
n/an/a 214n/an/an/an/an/an/a
Schering Plough Research Institute
Curated by ChEMBL
Assay Description
Inhibition of CDC2
Bioorg Med Chem Lett 20: 1384-7 (2010)
Article DOI: 10.1016/j.bmcl.2010.01.007
BindingDB Entry DOI: 10.7270/Q2QF8TTB
Aurora kinase A
(Homo sapiens (Human))
BDBM50306874
(8-Hydroxy-6H-benzo[f][1,3]dioxolo[4',5':4,5]benzo[...)
Show SMILES Oc1cccc2c1cc1NC(=O)c3cc4OCOc4c2c13
Show InChI InChI=1S/C16H9NO4/c18-11-3-1-2-7-8(11)4-10-13-9(16(19)17-10)5-12-15(14(7)13)21-6-20-12/h1-5,18H,6H2,(H,17,19)
NCI pathway
Reactome pathway
n/an/a 2.14E+3n/an/an/an/an/an/a
Schering Plough Research Institute
Curated by ChEMBL
Assay Description
Inhibition of AUR2
Bioorg Med Chem Lett 20: 1384-7 (2010)
Article DOI: 10.1016/j.bmcl.2010.01.007
BindingDB Entry DOI: 10.7270/Q2QF8TTB
Cyclin-dependent kinase 4
(Homo sapiens (Human))
BDBM50306874
(8-Hydroxy-6H-benzo[f][1,3]dioxolo[4',5':4,5]benzo[...)
Show SMILES Oc1cccc2c1cc1NC(=O)c3cc4OCOc4c2c13
Show InChI InChI=1S/C16H9NO4/c18-11-3-1-2-7-8(11)4-10-13-9(16(19)17-10)5-12-15(14(7)13)21-6-20-12/h1-5,18H,6H2,(H,17,19)
NCI pathway
Reactome pathway
n/an/a 1.42E+3n/an/an/an/an/an/a
Schering Plough Research Institute
Curated by ChEMBL
Assay Description
Inhibition of CDK4
Bioorg Med Chem Lett 20: 1384-7 (2010)
Article DOI: 10.1016/j.bmcl.2010.01.007
BindingDB Entry DOI: 10.7270/Q2QF8TTB
Cyclin-dependent kinase 2
(Homo sapiens (Human))
BDBM50306874
(8-Hydroxy-6H-benzo[f][1,3]dioxolo[4',5':4,5]benzo[...)
Show SMILES Oc1cccc2c1cc1NC(=O)c3cc4OCOc4c2c13
Show InChI InChI=1S/C16H9NO4/c18-11-3-1-2-7-8(11)4-10-13-9(16(19)17-10)5-12-15(14(7)13)21-6-20-12/h1-5,18H,6H2,(H,17,19)
NCI pathway
Reactome pathway
n/an/a 35n/an/an/an/an/an/a
Schering Plough Research Institute
Curated by ChEMBL
Assay Description
Inhibition of CDK2
Bioorg Med Chem Lett 20: 1384-7 (2010)
Article DOI: 10.1016/j.bmcl.2010.01.007
BindingDB Entry DOI: 10.7270/Q2QF8TTB