BDBM50307438 3-[4-[(4-Chlorophenoxy)methyl]-2-({[1-(3,5-dimethylphenyl)-3-methylbutyl]amino}carbonyl)phenyl]propanoic acid::CHEMBL597552
SMILES: CC(C)CC(NC(=O)c1cc(COc2ccc(Cl)cc2)ccc1CCC(O)=O)c1cc(C)cc(C)c1
InChI Key: InChIKey=GDNZFYOGEPYRIK-UHFFFAOYSA-N
Data: 1 KI  1 IC50
Activity Spreadsheet -- Enzyme Inhibition Constant Data from BindingDB
Found 2 hits for monomerid = 50307438
Trg + Lig
Ki
nM
ΔG°
kcal/mole
IC50
nM
Kd
nM
EC50/IC50
nM
koff
s-1
kon
M-1s-1
pHTemp
°C
Prostanoid EP3 Receptor
(Mus musculus (Mouse))
BDBM50307438
(3-[4-[(4-Chlorophenoxy)methyl]-2-({[1-(3,5-dimethy...)
Show SMILES CC(C)CC(NC(=O)c1cc(COc2ccc(Cl)cc2)ccc1CCC(O)=O)c1cc(C)cc(C)c1
Show InChI InChI=1S/C30H34ClNO4/c1-19(2)13-28(24-15-20(3)14-21(4)16-24)32-30(35)27-17-22(5-6-23(27)7-12-29(33)34)18-36-26-10-8-25(31)9-11-26/h5-6,8-11,14-17,19,28H,7,12-13,18H2,1-4H3,(H,32,35)(H,33,34)
0.620n/an/an/an/an/an/an/an/a
Minase Research Institute
Curated by ChEMBL
Assay Description
Displacement of [3H]PGE2 from mouse EP3 receptor expressed in CHO cell membrane
Bioorg Med Chem 18: 1641-58 (2010)
Article DOI: 10.1016/j.bmc.2009.12.068
BindingDB Entry DOI: 10.7270/Q29023W2
Prostanoid EP3 Receptor
(Mus musculus (Mouse))
BDBM50307438
(3-[4-[(4-Chlorophenoxy)methyl]-2-({[1-(3,5-dimethy...)
Show SMILES CC(C)CC(NC(=O)c1cc(COc2ccc(Cl)cc2)ccc1CCC(O)=O)c1cc(C)cc(C)c1
Show InChI InChI=1S/C30H34ClNO4/c1-19(2)13-28(24-15-20(3)14-21(4)16-24)32-30(35)27-17-22(5-6-23(27)7-12-29(33)34)18-36-26-10-8-25(31)9-11-26/h5-6,8-11,14-17,19,28H,7,12-13,18H2,1-4H3,(H,32,35)(H,33,34)
n/an/a 30n/an/an/an/an/an/a
Minase Research Institute
Curated by ChEMBL
Assay Description
Antagonist activity at mouse EP3 receptor expressed in CHO cells assessed as inhibition of PGE2-induced increase intracellular calcium level in prese...
Bioorg Med Chem 18: 1641-58 (2010)
Article DOI: 10.1016/j.bmc.2009.12.068
BindingDB Entry DOI: 10.7270/Q29023W2