BDBM50307441 3-{2-({[1-(3,5-Dimethylphenyl)-3-methylbutyl]amino}-carbonyl)-4-[(3-methylphenoxy)methyl]phenyl}propanoic acid::CHEMBL599203
SMILES: CC(C)CC(NC(=O)c1cc(COc2cccc(C)c2)ccc1CCC(O)=O)c1cc(C)cc(C)c1
InChI Key: InChIKey=VQNOXGXKPGYDCD-UHFFFAOYSA-N
Data: 1 KI  1 IC50
Activity Spreadsheet -- Enzyme Inhibition Constant Data from BindingDB
Found 2 hits for monomerid = 50307441
Trg + Lig
Ki
nM
ΔG°
kcal/mole
IC50
nM
Kd
nM
EC50/IC50
nM
koff
s-1
kon
M-1s-1
pHTemp
°C
Prostanoid EP3 Receptor
(Mus musculus (Mouse))
BDBM50307441
(3-{2-({[1-(3,5-Dimethylphenyl)-3-methylbutyl]amino...)
Show SMILES CC(C)CC(NC(=O)c1cc(COc2cccc(C)c2)ccc1CCC(O)=O)c1cc(C)cc(C)c1
Show InChI InChI=1S/C31H37NO4/c1-20(2)13-29(26-15-22(4)14-23(5)16-26)32-31(35)28-18-24(9-10-25(28)11-12-30(33)34)19-36-27-8-6-7-21(3)17-27/h6-10,14-18,20,29H,11-13,19H2,1-5H3,(H,32,35)(H,33,34)
0.110n/an/an/an/an/an/an/an/a
Minase Research Institute
Curated by ChEMBL
Assay Description
Displacement of [3H]PGE2 from mouse EP3 receptor expressed in CHO cell membrane
Bioorg Med Chem 18: 1641-58 (2010)
Article DOI: 10.1016/j.bmc.2009.12.068
BindingDB Entry DOI: 10.7270/Q29023W2
Prostanoid EP3 Receptor
(Mus musculus (Mouse))
BDBM50307441
(3-{2-({[1-(3,5-Dimethylphenyl)-3-methylbutyl]amino...)
Show SMILES CC(C)CC(NC(=O)c1cc(COc2cccc(C)c2)ccc1CCC(O)=O)c1cc(C)cc(C)c1
Show InChI InChI=1S/C31H37NO4/c1-20(2)13-29(26-15-22(4)14-23(5)16-26)32-31(35)28-18-24(9-10-25(28)11-12-30(33)34)19-36-27-8-6-7-21(3)17-27/h6-10,14-18,20,29H,11-13,19H2,1-5H3,(H,32,35)(H,33,34)
n/an/a 4.20n/an/an/an/an/an/a
Minase Research Institute
Curated by ChEMBL
Assay Description
Antagonist activity at mouse EP3 receptor expressed in CHO cells assessed as inhibition of PGE2-induced increase intracellular calcium level in prese...
Bioorg Med Chem 18: 1641-58 (2010)
Article DOI: 10.1016/j.bmc.2009.12.068
BindingDB Entry DOI: 10.7270/Q29023W2