BDBM50307520 8-(Cyclohexylamino)-1-methyl-4,5-dihydro-1H-pyrazolo[4,3-h]-quinazoline-3-carboxamide::CHEMBL591467
SMILES: Cn1nc(C(N)=O)c2CCc3cnc(NC4CCCCC4)nc3-c12
InChI Key: InChIKey=ABEYZUJMIYFBTH-UHFFFAOYSA-N
Data: 2 IC50
Activity Spreadsheet -- Enzyme Inhibition Constant Data from BindingDB
Found 2 hits for monomerid = 50307520
Trg + Lig
Ki
nM
ΔG°
kcal/mole
IC50
nM
Kd
nM
EC50/IC50
nM
koff
s-1
kon
M-1s-1
pHTemp
°C
Aurora kinase A
(Homo sapiens (Human))
BDBM50307520
(8-(Cyclohexylamino)-1-methyl-4,5-dihydro-1H-pyrazo...)
Show SMILES Cn1nc(C(N)=O)c2CCc3cnc(NC4CCCCC4)nc3-c12
Show InChI InChI=1S/C17H22N6O/c1-23-15-12(14(22-23)16(18)24)8-7-10-9-19-17(21-13(10)15)20-11-5-3-2-4-6-11/h9,11H,2-8H2,1H3,(H2,18,24)(H,19,20,21)
NCI pathway
Reactome pathway
n/an/a>1.00E+4n/an/an/an/an/an/a
Nerviano Medical Sciences Srl
Curated by ChEMBL
Assay Description
Inhibition of Aurora A
J Med Chem 53: 2171-87 (2010)
Article DOI: 10.1021/jm901710h
BindingDB Entry DOI: 10.7270/Q2N879W9
CDK2/Cyclin A/Cyclin A1
(Homo sapiens (Human))
BDBM50307520
(8-(Cyclohexylamino)-1-methyl-4,5-dihydro-1H-pyrazo...)
Show SMILES Cn1nc(C(N)=O)c2CCc3cnc(NC4CCCCC4)nc3-c12
Show InChI InChI=1S/C17H22N6O/c1-23-15-12(14(22-23)16(18)24)8-7-10-9-19-17(21-13(10)15)20-11-5-3-2-4-6-11/h9,11H,2-8H2,1H3,(H2,18,24)(H,19,20,21)
Reactome pathway
n/an/a 4n/an/an/an/an/an/a
Nerviano Medical Sciences Srl
Curated by ChEMBL
Assay Description
Inhibition of CDK2/Cyclin A
J Med Chem 53: 2171-87 (2010)
Article DOI: 10.1021/jm901710h
BindingDB Entry DOI: 10.7270/Q2N879W9