BDBM50307532 8-(Cyclohexylamino)-N-1-dimethyl-4,5-dihydro-1H-pyrazolo-[4,3-h]quinazoline-3-carboxamide::CHEMBL591463
SMILES: CNC(=O)c1nn(C)c-2c1CCc1cnc(NC3CCCCC3)nc-21
InChI Key: InChIKey=SZVPDWROAQYJHW-UHFFFAOYSA-N
Data: 2 IC50
Activity Spreadsheet -- Enzyme Inhibition Constant Data from BindingDB
Found 2 hits for monomerid = 50307532
Trg + Lig
Ki
nM
ΔG°
kcal/mole
IC50
nM
Kd
nM
EC50/IC50
nM
koff
s-1
kon
M-1s-1
pHTemp
°C
Aurora kinase A
(Homo sapiens (Human))
BDBM50307532
(8-(Cyclohexylamino)-N-1-dimethyl-4,5-dihydro-1H-py...)
Show SMILES CNC(=O)c1nn(C)c-2c1CCc1cnc(NC3CCCCC3)nc-21
Show InChI InChI=1S/C18H24N6O/c1-19-17(25)15-13-9-8-11-10-20-18(21-12-6-4-3-5-7-12)22-14(11)16(13)24(2)23-15/h10,12H,3-9H2,1-2H3,(H,19,25)(H,20,21,22)
NCI pathway
Reactome pathway
n/an/a>1.00E+4n/an/an/an/an/an/a
Nerviano Medical Sciences Srl
Curated by ChEMBL
Assay Description
Inhibition of Aurora A
J Med Chem 53: 2171-87 (2010)
Article DOI: 10.1021/jm901710h
BindingDB Entry DOI: 10.7270/Q2N879W9
CDK2/Cyclin A/Cyclin A1
(Homo sapiens (Human))
BDBM50307532
(8-(Cyclohexylamino)-N-1-dimethyl-4,5-dihydro-1H-py...)
Show SMILES CNC(=O)c1nn(C)c-2c1CCc1cnc(NC3CCCCC3)nc-21
Show InChI InChI=1S/C18H24N6O/c1-19-17(25)15-13-9-8-11-10-20-18(21-12-6-4-3-5-7-12)22-14(11)16(13)24(2)23-15/h10,12H,3-9H2,1-2H3,(H,19,25)(H,20,21,22)
Reactome pathway
n/an/a 39n/an/an/an/an/an/a
Nerviano Medical Sciences Srl
Curated by ChEMBL
Assay Description
Inhibition of CDK2/Cyclin A
J Med Chem 53: 2171-87 (2010)
Article DOI: 10.1021/jm901710h
BindingDB Entry DOI: 10.7270/Q2N879W9