BDBM50307948 4-(2-(Trifluoromethoxy)benzyl)-1-(7H-pyrrolo[2,3-d]pyrimidin-4-yl)-piperidin-4-amine::CHEMBL602236
SMILES: NC1(Cc2ccccc2OC(F)(F)F)CCN(CC1)c1ncnc2[nH]ccc12
InChI Key: InChIKey=UACJOVFOPOTOIP-UHFFFAOYSA-N
Data: 1 IC50
Activity Spreadsheet -- Enzyme Inhibition Constant Data from BindingDB
Found 1 hit for monomerid = 50307948
Trg + Lig
Ki
nM
ΔG°
kcal/mole
IC50
nM
Kd
nM
EC50/IC50
nM
koff
s-1
kon
M-1s-1
pHTemp
°C
RAC-beta serine/threonine-protein kinase
(Homo sapiens (Human))
BDBM50307948
(4-(2-(Trifluoromethoxy)benzyl)-1-(7H-pyrrolo[2,3-d...)
Show SMILES NC1(Cc2ccccc2OC(F)(F)F)CCN(CC1)c1ncnc2[nH]ccc12
Show InChI InChI=1S/C19H20F3N5O/c20-19(21,22)28-15-4-2-1-3-13(15)11-18(23)6-9-27(10-7-18)17-14-5-8-24-16(14)25-12-26-17/h1-5,8,12H,6-7,9-11,23H2,(H,24,25,26)
n/an/a 84n/an/an/an/an/an/a
Institute of Cancer Research
Curated by ChEMBL
Assay Description
Inhibition of PKBbeta by radiometric filter binding assay
J Med Chem 53: 2239-49 (2010)
Article DOI: 10.1021/jm901788j
BindingDB Entry DOI: 10.7270/Q23B608V