BDBM50307970 4-(2,5-Dichlorobenzyl)-1-(7H-pyrrolo[2,3-d]pyrimidin-4-yl)piperidin-4-amine::CHEMBL604917
SMILES: NC1(Cc2cc(Cl)ccc2Cl)CCN(CC1)c1ncnc2[nH]ccc12
InChI Key: InChIKey=ORSRCKUTAWPTFD-UHFFFAOYSA-N
Data: 1 IC50
Activity Spreadsheet -- Enzyme Inhibition Constant Data from BindingDB
Found 1 hit for monomerid = 50307970
Trg + Lig
Ki
nM
ΔG°
kcal/mole
IC50
nM
Kd
nM
EC50/IC50
nM
koff
s-1
kon
M-1s-1
pHTemp
°C
Serine/threonine-protein kinase AKT2
(Homo sapiens (Human))
BDBM50307970
(4-(2,5-Dichlorobenzyl)-1-(7H-pyrrolo[2,3-d]pyrimid...)
Show SMILES NC1(Cc2cc(Cl)ccc2Cl)CCN(CC1)c1ncnc2[nH]ccc12
Show InChI InChI=1S/C18H19Cl2N5/c19-13-1-2-15(20)12(9-13)10-18(21)4-7-25(8-5-18)17-14-3-6-22-16(14)23-11-24-17/h1-3,6,9,11H,4-5,7-8,10,21H2,(H,22,23,24)
n/an/a 16n/an/an/an/an/an/a
Institute of Cancer Research
Curated by ChEMBL
Assay Description
Inhibition of PKBbeta by radiometric filter binding assay
J Med Chem 53: 2239-49 (2010)
Article DOI: 10.1021/jm901788j
BindingDB Entry DOI: 10.7270/Q23B608V