BDBM50307982 4-(3-Chlorobenzyl)-1-(7H-pyrrolo[2,3-d]pyrimidin-4-yl)piperidin-4-amine::CHEMBL598438
SMILES: NC1(Cc2cccc(Cl)c2)CCN(CC1)c1ncnc2[nH]ccc12
InChI Key: InChIKey=YMCDTLKIUYZDTC-UHFFFAOYSA-N
Data: 1 IC50
Activity Spreadsheet -- Enzyme Inhibition Constant Data from BindingDB
Found 1 hit for monomerid = 50307982
Trg + Lig
Ki
nM
ΔG°
kcal/mole
IC50
nM
Kd
nM
EC50/IC50
nM
koff
s-1
kon
M-1s-1
pHTemp
°C
Serine/threonine-protein kinase AKT2
(Homo sapiens (Human))
BDBM50307982
(4-(3-Chlorobenzyl)-1-(7H-pyrrolo[2,3-d]pyrimidin-4...)
Show SMILES NC1(Cc2cccc(Cl)c2)CCN(CC1)c1ncnc2[nH]ccc12
Show InChI InChI=1S/C18H20ClN5/c19-14-3-1-2-13(10-14)11-18(20)5-8-24(9-6-18)17-15-4-7-21-16(15)22-12-23-17/h1-4,7,10,12H,5-6,8-9,11,20H2,(H,21,22,23)
n/an/a 46n/an/an/an/an/an/a
Institute of Cancer Research
Curated by ChEMBL
Assay Description
Inhibition of PKBbeta by radiometric filter binding assay
J Med Chem 53: 2239-49 (2010)
Article DOI: 10.1021/jm901788j
BindingDB Entry DOI: 10.7270/Q23B608V