BDBM50308062 1-Isopropyl-4-(4-isopropyl-phenyl)-6-methoxy-1H-quinazolin-2-one::CHEMBL597206
SMILES: COc1ccc2n(C(C)C)c(=O)nc(-c3ccc(cc3)C(C)C)c2c1
InChI Key: InChIKey=FGKAKPPMUXXDDV-UHFFFAOYSA-N
Data: 1 IC50
Activity Spreadsheet -- Enzyme Inhibition Constant Data from BindingDB
Found 1 hit for monomerid = 50308062
Trg + Lig
Ki
nM
ΔG°
kcal/mole
IC50
nM
Kd
nM
EC50/IC50
nM
koff
s-1
kon
M-1s-1
pHTemp
°C
Calcium-sensing receptor (CaSR)
(Homo sapiens (Human))
BDBM50308062
(1-Isopropyl-4-(4-isopropyl-phenyl)-6-methoxy-1H-qu...)
Show SMILES COc1ccc2n(C(C)C)c(=O)nc(-c3ccc(cc3)C(C)C)c2c1
Show InChI InChI=1S/C21H24N2O2/c1-13(2)15-6-8-16(9-7-15)20-18-12-17(25-5)10-11-19(18)23(14(3)4)21(24)22-20/h6-14H,1-5H3
n/an/a 1.40E+3n/an/an/an/an/an/a
Novartis Institutes for BioMedical Research
Curated by ChEMBL
Assay Description
Antagonist activity at human CaSR expressed in CCL39 cells assessed as inhibition of extracellular calcium-induced intracellular calcium transient by...
J Med Chem 53: 2250-63 (2010)
Article DOI: 10.1021/jm901811v
BindingDB Entry DOI: 10.7270/Q2Q240BT