BDBM50308063 1-Isopropyl-4-phenyl-6-methoxy-1H-quinazolin-2-one::CHEMBL590710
SMILES: COc1ccc2n(C(C)C)c(=O)nc(-c3ccccc3)c2c1
InChI Key: InChIKey=QGHJRJCNYBJPFL-UHFFFAOYSA-N
Data: 1 IC50
Activity Spreadsheet -- Enzyme Inhibition Constant Data from BindingDB
Found 1 hit for monomerid = 50308063
Trg + Lig
Ki
nM
ΔG°
kcal/mole
IC50
nM
Kd
nM
EC50/IC50
nM
koff
s-1
kon
M-1s-1
pHTemp
°C
Calcium-sensing receptor (CaSR)
(Homo sapiens (Human))
BDBM50308063
(1-Isopropyl-4-phenyl-6-methoxy-1H-quinazolin-2-one...)
Show SMILES COc1ccc2n(C(C)C)c(=O)nc(-c3ccccc3)c2c1
Show InChI InChI=1S/C18H18N2O2/c1-12(2)20-16-10-9-14(22-3)11-15(16)17(19-18(20)21)13-7-5-4-6-8-13/h4-12H,1-3H3
n/an/a>3.00E+4n/an/an/an/an/an/a
Novartis Institutes for BioMedical Research
Curated by ChEMBL
Assay Description
Antagonist activity at human CaSR expressed in CCL39 cells assessed as inhibition of extracellular calcium-induced intracellular calcium transient by...
J Med Chem 53: 2250-63 (2010)
Article DOI: 10.1021/jm901811v
BindingDB Entry DOI: 10.7270/Q2Q240BT