BDBM50308083 1-(4-Isopropyl-benzyl)-4-(4-isopropyl-phenyl)-6-propargyloxy-1H-quinazolin-2-one::CHEMBL604713
SMILES: CC(C)c1ccc(Cn2c3ccc(OCC#C)cc3c(nc2=O)-c2ccc(cc2)C(C)C)cc1
InChI Key: InChIKey=PJKVUIFHOSCJBW-UHFFFAOYSA-N
Data: 1 IC50
Activity Spreadsheet -- Enzyme Inhibition Constant Data from BindingDB
Found 1 hit for monomerid = 50308083
Trg + Lig
Ki
nM
ΔG°
kcal/mole
IC50
nM
Kd
nM
EC50/IC50
nM
koff
s-1
kon
M-1s-1
pHTemp
°C
Calcium-sensing receptor (CaSR)
(Homo sapiens (Human))
BDBM50308083
(1-(4-Isopropyl-benzyl)-4-(4-isopropyl-phenyl)-6-pr...)
Show SMILES CC(C)c1ccc(Cn2c3ccc(OCC#C)cc3c(nc2=O)-c2ccc(cc2)C(C)C)cc1
Show InChI InChI=1S/C30H30N2O2/c1-6-17-34-26-15-16-28-27(18-26)29(25-13-11-24(12-14-25)21(4)5)31-30(33)32(28)19-22-7-9-23(10-8-22)20(2)3/h1,7-16,18,20-21H,17,19H2,2-5H3
n/an/a 27n/an/an/an/an/an/a
Novartis Institutes for BioMedical Research
Curated by ChEMBL
Assay Description
Antagonist activity at human CaSR expressed in CCL39 cells assessed as inhibition of extracellular calcium-induced intracellular calcium transient by...
J Med Chem 53: 2250-63 (2010)
Article DOI: 10.1021/jm901811v
BindingDB Entry DOI: 10.7270/Q2Q240BT