BDBM50308167 (3R)-N,N-Dimethyl-1-[3-(1-naphthylsulfonyl)-1H-indazol-5-yl]pyrrolidin-3-amine::CHEMBL598444
SMILES: CN(C)[C@@H]1CCN(C1)c1ccc2[nH]nc(c2c1)S(=O)(=O)c1cccc2ccccc12
InChI Key: InChIKey=ADEIHMYSULIEAK-GOSISDBHSA-N
Data: 2 KI  1 IC50
Activity Spreadsheet -- Enzyme Inhibition Constant Data from BindingDB
Found 3 hits for monomerid = 50308167
Trg + Lig
Ki
nM
ΔG°
kcal/mole
IC50
nM
Kd
nM
EC50/IC50
nM
koff
s-1
kon
M-1s-1
pHTemp
°C
5-hydroxytryptamine receptor 6
(Homo sapiens (Human))
BDBM50308167
((3R)-N,N-Dimethyl-1-[3-(1-naphthylsulfonyl)-1H-ind...)
Show SMILES CN(C)[C@@H]1CCN(C1)c1ccc2[nH]nc(c2c1)S(=O)(=O)c1cccc2ccccc12 |r|
Show InChI InChI=1S/C23H24N4O2S/c1-26(2)18-12-13-27(15-18)17-10-11-21-20(14-17)23(25-24-21)30(28,29)22-9-5-7-16-6-3-4-8-19(16)22/h3-11,14,18H,12-13,15H2,1-2H3,(H,24,25)/t18-/m1/s1
Reactome pathway
0.510n/an/an/an/an/an/an/an/a
Wyeth Research
Curated by ChEMBL
Assay Description
Displacement of [3H]LSD from human 5HT6 receptor by scintillation counting
J Med Chem 53: 2521-7 (2010)
Article DOI: 10.1021/jm901674f
BindingDB Entry DOI: 10.7270/Q22B8Z43
5-hydroxytryptamine receptor 2B
(Homo sapiens (Human))
BDBM50308167
((3R)-N,N-Dimethyl-1-[3-(1-naphthylsulfonyl)-1H-ind...)
Show SMILES CN(C)[C@@H]1CCN(C1)c1ccc2[nH]nc(c2c1)S(=O)(=O)c1cccc2ccccc12 |r|
Show InChI InChI=1S/C23H24N4O2S/c1-26(2)18-12-13-27(15-18)17-10-11-21-20(14-17)23(25-24-21)30(28,29)22-9-5-7-16-6-3-4-8-19(16)22/h3-11,14,18H,12-13,15H2,1-2H3,(H,24,25)/t18-/m1/s1
Reactome pathway
423n/an/an/an/an/an/an/an/a
Wyeth Research
Curated by ChEMBL
Assay Description
Displacement of [3H]5HT from human 5HT2B receptor expressed in CHO cells by scintillation counting
J Med Chem 53: 2521-7 (2010)
Article DOI: 10.1021/jm901674f
BindingDB Entry DOI: 10.7270/Q22B8Z43
5-hydroxytryptamine receptor 6
(Homo sapiens (Human))
BDBM50308167
((3R)-N,N-Dimethyl-1-[3-(1-naphthylsulfonyl)-1H-ind...)
Show SMILES CN(C)[C@@H]1CCN(C1)c1ccc2[nH]nc(c2c1)S(=O)(=O)c1cccc2ccccc12 |r|
Show InChI InChI=1S/C23H24N4O2S/c1-26(2)18-12-13-27(15-18)17-10-11-21-20(14-17)23(25-24-21)30(28,29)22-9-5-7-16-6-3-4-8-19(16)22/h3-11,14,18H,12-13,15H2,1-2H3,(H,24,25)/t18-/m1/s1
Reactome pathway
n/an/a 39.6n/an/an/an/an/an/a
Wyeth Research
Curated by ChEMBL
Assay Description
Antagonist activity at human cloned 5HT6 receptor expressed in human HeLa cells assessed as intracellular cAMP formation by RIA
J Med Chem 53: 2521-7 (2010)
Article DOI: 10.1021/jm901674f
BindingDB Entry DOI: 10.7270/Q22B8Z43