BDBM50308259 1-O-Methyl-2,3-O-isopropylidene-5-[4-(1-hydroxycyclohexil)-1H-1,2,3-triazol-1-yl]-beta-D-ribofuranose::CHEMBL597186
SMILES: CO[C@@H]1O[C@H](Cn2cc(nn2)C2(O)CCCCC2)[C@H]2OC(C)(C)O[C@@H]12
InChI Key: InChIKey=KEDSMYNZCHZVNL-NMFUWQPSSA-N
Data: 1 IC50
Activity Spreadsheet -- Enzyme Inhibition Constant Data from BindingDB
Found 1 hit for monomerid = 50308259
Trg + Lig
Ki
nM
ΔG°
kcal/mole
IC50
nM
Kd
nM
EC50/IC50
nM
koff
s-1
kon
M-1s-1
pHTemp
°C
Alpha-glucosidase MAL12
(Saccharomyces cerevisiae)
BDBM50308259
(1-O-Methyl-2,3-O-isopropylidene-5-[4-(1-hydroxycyc...)
Show SMILES CO[C@@H]1O[C@H](Cn2cc(nn2)C2(O)CCCCC2)[C@H]2OC(C)(C)O[C@@H]12 |r|
Show InChI InChI=1S/C17H27N3O5/c1-16(2)24-13-11(23-15(22-3)14(13)25-16)9-20-10-12(18-19-20)17(21)7-5-4-6-8-17/h10-11,13-15,21H,4-9H2,1-3H3/t11-,13-,14-,15-/m1/s1
Reactome pathway
n/an/a 5.20E+3n/an/an/an/an/an/a
Universidade Federal do Rio de Janeiro
Curated by ChEMBL
Assay Description
Inhibition of yeast alpha-glucosidase MAL12 assessed as inhibition of p-nitrophenol release by spectrophotometry
J Med Chem 53: 2364-75 (2010)
Article DOI: 10.1021/jm901265h
BindingDB Entry DOI: 10.7270/Q20R9QC7