BDBM50308718 6,7-furano-5-prenyloxy hydrocoumaric acid::CHEMBL589100
SMILES: [#6]\[#6](-[#6])=[#6]\[#6]-[#8]-c1c(-[#6]-[#6]-[#6](-[#8])=O)c(-[#8])cc2occc12
InChI Key: InChIKey=VWIHQCIOZYEEGK-UHFFFAOYSA-N
Data: 1 IC50
Activity Spreadsheet -- Enzyme Inhibition Constant Data from BindingDB
Found 1 hit for monomerid = 50308718
Trg + Lig
Ki
nM
ΔG°
kcal/mole
IC50
nM
Kd
nM
EC50/IC50
nM
koff
s-1
kon
M-1s-1
pHTemp
°C
Beta-secretase 1
(Homo sapiens (Human))
BDBM50308718
(6,7-furano-5-prenyloxy hydrocoumaric acid | CHEMBL...)
Show SMILES [#6]\[#6](-[#6])=[#6]\[#6]-[#8]-c1c(-[#6]-[#6]-[#6](-[#8])=O)c(-[#8])cc2occc12
Show InChI InChI=1S/C16H18O5/c1-10(2)5-7-21-16-11(3-4-15(18)19)13(17)9-14-12(16)6-8-20-14/h5-6,8-9,17H,3-4,7H2,1-2H3,(H,18,19)
n/an/a 1.86E+5n/an/an/an/an/an/a
Kinki University
Curated by ChEMBL
Assay Description
Inhibition of human recombinant BACE1 after 60 mins by fluorescence assay
Bioorg Med Chem 18: 455-9 (2010)
Article DOI: 10.1016/j.bmc.2009.10.004
BindingDB Entry DOI: 10.7270/Q2K64J6S