null
SMILES: [#6]-[#8]-c1cc2occc2c(-[#8]-[#6]\[#6]=[#6](\[#6])-[#6])c1-[#6]-[#6]-[#6](-[#8])=O
InChI Key: InChIKey=ASTLBNTZIYCRIB-UHFFFAOYSA-N
Activity Spreadsheet -- Enzyme Inhibition Constant Data from BindingDB
Found 1 hit for monomerid = 50308721
Trg + Lig
Ki
nM
ΔG°
kcal/mole
IC50
nM
Kd
nM
EC50/IC50
nM
koff
s-1
kon
M-1s-1
pHTemp
°C
Beta-secretase 1
(Homo sapiens (Human))
BDBM50308721
(6,7-Furano-8a-methoxy-5-prenyloxy hydrocoumaric ac...)
Show SMILES [#6]-[#8]-c1cc2occc2c(-[#8]-[#6]\[#6]=[#6](\[#6])-[#6])c1-[#6]-[#6]-[#6](-[#8])=O
Show InChI InChI=1S/C17H20O5/c1-11(2)6-8-22-17-12(4-5-16(18)19)14(20-3)10-15-13(17)7-9-21-15/h6-7,9-10H,4-5,8H2,1-3H3,(H,18,19)
n/an/a 2.03E+5n/an/an/an/an/an/a
Kinki University
Curated by ChEMBL
Assay Description
Inhibition of human recombinant BACE1 after 60 mins by fluorescence assay
Bioorg Med Chem 18: 455-9 (2010)
Article DOI: 10.1016/j.bmc.2009.10.004
BindingDB Entry DOI: 10.7270/Q2K64J6S