BDBM50308738 CHEMBL589813::Isopropyl-2-methyl-5-[4-(methylsulfonyl)phenyl]-1-[3,4-(difluoro)phenyl]-1H-pyrrol-3-acetate
SMILES: CC(C)OC(=O)Cc1cc(-c2ccc(cc2)S(C)(=O)=O)n(c1C)-c1ccc(F)c(F)c1
InChI Key: InChIKey=YBFSRNJNJQVVGK-UHFFFAOYSA-N
Data: 4 IC50
Activity Spreadsheet -- Enzyme Inhibition Constant Data from BindingDB
Found 4 hits for monomerid = 50308738
Trg + Lig
Ki
nM
ΔG°
kcal/mole
IC50
nM
Kd
nM
EC50/IC50
nM
koff
s-1
kon
M-1s-1
pHTemp
°C
Cyclooxygenase-2 (COX-2)
(Mus musculus (Mouse))
BDBM50308738
(CHEMBL589813 | Isopropyl-2-methyl-5-[4-(methylsulf...)
Show SMILES CC(C)OC(=O)Cc1cc(-c2ccc(cc2)S(C)(=O)=O)n(c1C)-c1ccc(F)c(F)c1
Show InChI InChI=1S/C23H23F2NO4S/c1-14(2)30-23(27)12-17-11-22(16-5-8-19(9-6-16)31(4,28)29)26(15(17)3)18-7-10-20(24)21(25)13-18/h5-11,13-14H,12H2,1-4H3
n/an/a 9.00E+4n/an/an/an/an/an/a
Universit£ La Sapienza
Curated by ChEMBL
Assay Description
Inhibition of COX2-dependent PGE2 production in LPS-stimulated mouse J774 cells at 10 uM by RIA
J Med Chem 53: 723-33 (2010)
Article DOI: 10.1021/jm901269y
BindingDB Entry DOI: 10.7270/Q25X291D
Cyclooxygenase-2 (COX-2)
(Mus musculus (Mouse))
BDBM50308738
(CHEMBL589813 | Isopropyl-2-methyl-5-[4-(methylsulf...)
Show SMILES CC(C)OC(=O)Cc1cc(-c2ccc(cc2)S(C)(=O)=O)n(c1C)-c1ccc(F)c(F)c1
Show InChI InChI=1S/C23H23F2NO4S/c1-14(2)30-23(27)12-17-11-22(16-5-8-19(9-6-16)31(4,28)29)26(15(17)3)18-7-10-20(24)21(25)13-18/h5-11,13-14H,12H2,1-4H3
n/an/a 8.50E+4n/an/an/an/an/an/a
Universit£ La Sapienza
Curated by ChEMBL
Assay Description
Inhibition of COX2-dependent PGE2 production in LPS-stimulated mouse J774 cells at 1 uM by RIA
J Med Chem 53: 723-33 (2010)
Article DOI: 10.1021/jm901269y
BindingDB Entry DOI: 10.7270/Q25X291D
Prostaglandin G/H synthase (cyclooxygenase)
(Mus musculus)
BDBM50308738
(CHEMBL589813 | Isopropyl-2-methyl-5-[4-(methylsulf...)
Show SMILES CC(C)OC(=O)Cc1cc(-c2ccc(cc2)S(C)(=O)=O)n(c1C)-c1ccc(F)c(F)c1
Show InChI InChI=1S/C23H23F2NO4S/c1-14(2)30-23(27)12-17-11-22(16-5-8-19(9-6-16)31(4,28)29)26(15(17)3)18-7-10-20(24)21(25)13-18/h5-11,13-14H,12H2,1-4H3
Reactome pathway
n/an/a>1.00E+5n/an/an/an/an/an/a
Universit£ La Sapienza
Curated by ChEMBL
Assay Description
Inhibition of COX1-dependent PGE2 production in LPS-stimulated mouse J774 cells by RIA
J Med Chem 53: 723-33 (2010)
Article DOI: 10.1021/jm901269y
BindingDB Entry DOI: 10.7270/Q25X291D
Cyclooxygenase-2 (COX-2)
(Mus musculus (Mouse))
BDBM50308738
(CHEMBL589813 | Isopropyl-2-methyl-5-[4-(methylsulf...)
Show SMILES CC(C)OC(=O)Cc1cc(-c2ccc(cc2)S(C)(=O)=O)n(c1C)-c1ccc(F)c(F)c1
Show InChI InChI=1S/C23H23F2NO4S/c1-14(2)30-23(27)12-17-11-22(16-5-8-19(9-6-16)31(4,28)29)26(15(17)3)18-7-10-20(24)21(25)13-18/h5-11,13-14H,12H2,1-4H3
n/an/a 21n/an/an/an/an/an/a
Universit£ La Sapienza
Curated by ChEMBL
Assay Description
Inhibition of COX2-dependent PGE2 production in LPS-stimulated mouse J774 cells by RIA
J Med Chem 53: 723-33 (2010)
Article DOI: 10.1021/jm901269y
BindingDB Entry DOI: 10.7270/Q25X291D