BDBM50308750 3-(Methyl-N-ethylcarbamate)-6-(N0-methylphenylamino)indazol-4,7-dione::CHEMBL603058
SMILES: COC(=O)N=CCc1n[nH]c2c(O)c(cc(O)c12)N(C)c1ccccc1
InChI Key: InChIKey=OXFJWRWHEKFGEU-UHFFFAOYSA-N
Data: 2 IC50
Activity Spreadsheet -- Enzyme Inhibition Constant Data from BindingDB
Found 2 hits for monomerid = 50308750
Trg + Lig
Ki
nM
ΔG°
kcal/mole
IC50
nM
Kd
nM
EC50/IC50
nM
koff
s-1
kon
M-1s-1
pHTemp
°C
Carbonyl reductase [NADPH] 1
(Homo sapiens (Human))
BDBM50308750
(3-(Methyl-N-ethylcarbamate)-6-(N0-methylphenylamin...)
Show SMILES COC(=O)N=CCc1n[nH]c2c(O)c(cc(O)c12)N(C)c1ccccc1 |w:5.5|
Show InChI InChI=1S/C18H18N4O4/c1-22(11-6-4-3-5-7-11)13-10-14(23)15-12(8-9-19-18(25)26-2)20-21-16(15)17(13)24/h3-7,9-10,23-24H,8H2,1-2H3,(H,20,21)
Reactome pathway
n/an/a 1.10E+4n/an/an/an/an/an/a
Howard University
Curated by ChEMBL
Assay Description
Displacement of daunorubicin from human recombinant CBR expressed in Escherichia coli BL21 (DE3)
Bioorg Med Chem 18: 134-41 (2010)
Article DOI: 10.1016/j.bmc.2009.11.011
BindingDB Entry DOI: 10.7270/Q2XG9R7G
Carbonyl reductase [NADPH] 1
(Homo sapiens (Human))
BDBM50308750
(3-(Methyl-N-ethylcarbamate)-6-(N0-methylphenylamin...)
Show SMILES COC(=O)N=CCc1n[nH]c2c(O)c(cc(O)c12)N(C)c1ccccc1 |w:5.5|
Show InChI InChI=1S/C18H18N4O4/c1-22(11-6-4-3-5-7-11)13-10-14(23)15-12(8-9-19-18(25)26-2)20-21-16(15)17(13)24/h3-7,9-10,23-24H,8H2,1-2H3,(H,20,21)
Reactome pathway
n/an/a 4.00E+3n/an/an/an/an/an/a
Howard University
Curated by ChEMBL
Assay Description
Displacement of menadione from human recombinant CBR expressed in Escherichia coli BL21 (DE3)
Bioorg Med Chem 18: 134-41 (2010)
Article DOI: 10.1016/j.bmc.2009.11.011
BindingDB Entry DOI: 10.7270/Q2XG9R7G