BDBM50308755 CHEMBL589415::N-(4-Methyl-3-(3-methyl-4-oxo-3,4-dihydroquinazolin-6-ylamino)phenyl)-5-phenyl-2-(trifluoromethyl)-1H-imidazole-4-carboxamide
SMILES: Cc1ccc(NC(=O)c2[nH]c(nc2-c2ccccc2)C(F)(F)F)cc1Nc1ccc2ncn(C)c(=O)c2c1
InChI Key: InChIKey=OYMMUIOAGAZCAO-UHFFFAOYSA-N
Data: 1 IC50
Activity Spreadsheet -- Enzyme Inhibition Constant Data from BindingDB
Found 1 hit for monomerid = 50308755
Trg + Lig
Ki
nM
ΔG°
kcal/mole
IC50
nM
Kd
nM
EC50/IC50
nM
koff
s-1
kon
M-1s-1
pHTemp
°C
Mitogen-activated protein kinase 14
(Homo sapiens (Human))
BDBM50308755
(CHEMBL589415 | N-(4-Methyl-3-(3-methyl-4-oxo-3,4-d...)
Show SMILES Cc1ccc(NC(=O)c2[nH]c(nc2-c2ccccc2)C(F)(F)F)cc1Nc1ccc2ncn(C)c(=O)c2c1
Show InChI InChI=1S/C27H21F3N6O2/c1-15-8-9-18(13-21(15)32-17-10-11-20-19(12-17)25(38)36(2)14-31-20)33-24(37)23-22(16-6-4-3-5-7-16)34-26(35-23)27(28,29)30/h3-14,32H,1-2H3,(H,33,37)(H,34,35)
NCI pathway
Reactome pathway
n/an/a 405n/an/an/an/an/an/a
The University of Arizona
Curated by ChEMBL
Assay Description
Inhibition of human recombinant full length p38alpha assessed as MAPKAPK2 phosphorylation by [32P]ATP SDS-PAGE gel kinase assay
Bioorg Med Chem 18: 292-304 (2010)
Article DOI: 10.1016/j.bmc.2009.10.055
BindingDB Entry DOI: 10.7270/Q2SQ90H4