BDBM50308785 CHEMBL591357::N-Ethyl-4-({[4-(3-ethyl-7-morpholin-4-yl-3H-[1,2,3]-triazolo[4,5-d]pyrimidin-5-yl)phenyl]carbamoyl}amino)benzamide
SMILES: CCNC(=O)c1ccc(NC(=O)Nc2ccc(cc2)-c2nc(N3CCOCC3)c3nnn(CC)c3n2)cc1
InChI Key: InChIKey=ZXGQCEYIWIQYRV-UHFFFAOYSA-N
Data: 3 IC50
Activity Spreadsheet -- Enzyme Inhibition Constant Data from BindingDB
Found 3 hits for monomerid = 50308785
Trg + Lig
Ki
nM
ΔG°
kcal/mole
IC50
nM
Kd
nM
EC50/IC50
nM
koff
s-1
kon
M-1s-1
pHTemp
°C
Phosphatidylinositol 4,5-bisphosphate 3-kinase catalytic subunit alpha isoform
(Homo sapiens (Human))
BDBM50308785
(CHEMBL591357 | N-Ethyl-4-({[4-(3-ethyl-7-morpholin...)
Show SMILES CCNC(=O)c1ccc(NC(=O)Nc2ccc(cc2)-c2nc(N3CCOCC3)c3nnn(CC)c3n2)cc1
Show InChI InChI=1S/C26H29N9O3/c1-3-27-25(36)18-7-11-20(12-8-18)29-26(37)28-19-9-5-17(6-10-19)22-30-23(34-13-15-38-16-14-34)21-24(31-22)35(4-2)33-32-21/h5-12H,3-4,13-16H2,1-2H3,(H,27,36)(H2,28,29,37)
NCI pathway
Reactome pathway
n/an/a 3n/an/an/an/an/an/a
Wyeth Research
Curated by ChEMBL
Assay Description
Inhibition of human PI3Kalpha by fluorescence polarization format assay
J Med Chem 53: 798-810 (2010)
Article DOI: 10.1021/jm9014982
BindingDB Entry DOI: 10.7270/Q2NZ87RZ
Serine/threonine-protein kinase mTOR
(Homo sapiens (Human))
BDBM50308785
(CHEMBL591357 | N-Ethyl-4-({[4-(3-ethyl-7-morpholin...)
Show SMILES CCNC(=O)c1ccc(NC(=O)Nc2ccc(cc2)-c2nc(N3CCOCC3)c3nnn(CC)c3n2)cc1
Show InChI InChI=1S/C26H29N9O3/c1-3-27-25(36)18-7-11-20(12-8-18)29-26(37)28-19-9-5-17(6-10-19)22-30-23(34-13-15-38-16-14-34)21-24(31-22)35(4-2)33-32-21/h5-12H,3-4,13-16H2,1-2H3,(H,27,36)(H2,28,29,37)
NCI pathway
Reactome pathway
n/an/a 0.560n/an/an/an/an/an/a
Wyeth Research
Curated by ChEMBL
Assay Description
Inhibition of mTOR by DELFIA
J Med Chem 53: 798-810 (2010)
Article DOI: 10.1021/jm9014982
BindingDB Entry DOI: 10.7270/Q2NZ87RZ
Phosphatidylinositol 4,5-bisphosphate 3-kinase catalytic subunit gamma isoform
(Homo sapiens (Human))
BDBM50308785
(CHEMBL591357 | N-Ethyl-4-({[4-(3-ethyl-7-morpholin...)
Show SMILES CCNC(=O)c1ccc(NC(=O)Nc2ccc(cc2)-c2nc(N3CCOCC3)c3nnn(CC)c3n2)cc1
Show InChI InChI=1S/C26H29N9O3/c1-3-27-25(36)18-7-11-20(12-8-18)29-26(37)28-19-9-5-17(6-10-19)22-30-23(34-13-15-38-16-14-34)21-24(31-22)35(4-2)33-32-21/h5-12H,3-4,13-16H2,1-2H3,(H,27,36)(H2,28,29,37)
NCI pathway
Reactome pathway
n/an/a 17.2n/an/an/an/an/an/a
Wyeth Research
Curated by ChEMBL
Assay Description
Inhibition of human PI3Kgamma by fluorescence polarization format assay
J Med Chem 53: 798-810 (2010)
Article DOI: 10.1021/jm9014982
BindingDB Entry DOI: 10.7270/Q2NZ87RZ