BDBM50309243 (R)-6-(4-fluoro-3-(4-(pyrrolidine-2-carbonyl)piperazine-1-carbonyl)benzyl)-4,5-dimethylpyridazin-3(2H)-one::CHEMBL605760
SMILES: Cc1c(Cc2ccc(F)c(c2)C(=O)N2CCN(CC2)C(=O)[C@H]2CCCN2)n[nH]c(=O)c1C
InChI Key: InChIKey=ZBDIRHOICWZSET-LJQANCHMSA-N
Data: 1 IC50
Activity Spreadsheet -- Enzyme Inhibition Constant Data from BindingDB
Found 1 hit for monomerid = 50309243
Trg + Lig
Ki
nM
ΔG°
kcal/mole
IC50
nM
Kd
nM
EC50/IC50
nM
koff
s-1
kon
M-1s-1
pHTemp
°C
Poly [ADP-ribose] polymerase 1
(Homo sapiens (Human))
BDBM50309243
((R)-6-(4-fluoro-3-(4-(pyrrolidine-2-carbonyl)piper...)
Show SMILES Cc1c(Cc2ccc(F)c(c2)C(=O)N2CCN(CC2)C(=O)[C@H]2CCCN2)n[nH]c(=O)c1C |r|
Show InChI InChI=1S/C23H28FN5O3/c1-14-15(2)21(30)27-26-20(14)13-16-5-6-18(24)17(12-16)22(31)28-8-10-29(11-9-28)23(32)19-4-3-7-25-19/h5-6,12,19,25H,3-4,7-11,13H2,1-2H3,(H,27,30)/t19-/m1/s1
n/an/a 2.70n/an/an/an/an/an/a
Merck Research Laboratories Rome
Curated by ChEMBL
Assay Description
Inhibition of PARP1
Bioorg Med Chem Lett 20: 1100-5 (2010)
Article DOI: 10.1016/j.bmcl.2009.11.087
BindingDB Entry DOI: 10.7270/Q2Z89CJ6