null
SMILES: Cc1c(C)c(=O)[nH]nc1Cc1ccc(F)c(c1)C(=O)N1CCN(CC1)C(=O)C1(CC=C)CCCN1
InChI Key: InChIKey=BPNZSNBHBMBOPX-UHFFFAOYSA-N
Activity Spreadsheet -- Enzyme Inhibition Constant Data from BindingDB
Found 1 hit for monomerid = 50309249
Trg + Lig
Ki
nM
ΔG°
kcal/mole
IC50
nM
Kd
nM
EC50/IC50
nM
koff
s-1
kon
M-1s-1
pHTemp
°C
Poly [ADP-ribose] polymerase 1
(Homo sapiens (Human))
BDBM50309249
(6-(3-(4-(2-allylpyrrolidine-2-carbonyl)piperazine-...)
Show SMILES Cc1c(C)c(=O)[nH]nc1Cc1ccc(F)c(c1)C(=O)N1CCN(CC1)C(=O)C1(CC=C)CCCN1
Show InChI InChI=1S/C26H32FN5O3/c1-4-8-26(9-5-10-28-26)25(35)32-13-11-31(12-14-32)24(34)20-15-19(6-7-21(20)27)16-22-17(2)18(3)23(33)30-29-22/h4,6-7,15,28H,1,5,8-14,16H2,2-3H3,(H,30,33)
n/an/a 1.80n/an/an/an/an/an/a
Merck Research Laboratories Rome
Curated by ChEMBL
Assay Description
Inhibition of PARP1
Bioorg Med Chem Lett 20: 1100-5 (2010)
Article DOI: 10.1016/j.bmcl.2009.11.087
BindingDB Entry DOI: 10.7270/Q2Z89CJ6